{"text_format":"1","workbook":"xlsx","n_sheets":6,"sheets":["КОМАНДЫ ПП","ГРАФИК ПП","КОМАНДЫ ПП РАСЧ","ЗАГРУЖЕННОСТЬ","ПЛАН ПП","ПЛАН ПП (2)"],"not_rendered":{"charts":0,"images":0,"macros":1,"external_links":0,"defined_names":8,"comments":2,"pivot_tables":0},"unopened":[],"bounds":{"document_bytes":16777216,"sheet_cells":100000,"rows_first":2000,"rows_last":500,"rows_between":2000,"halvings":0,"cell_chars":16384,"cell_head_chars":4096},"cells_cut":0,"cells_raw":0,"read":"whole","date_system":"1900"}

{"sheet":"КОМАНДЫ ПП","index":0,"n_rows":28,"n_cols":33,"rows_kept":28,"cut":false,"hidden":false,"merged":[[1,4,1,6],[1,7,1,9],[1,10,1,12]]}
[null,null,null,null,null,null,null,null,null,null,"ПАРТНЕРСКИЕ ПРОВЕРКИ ВАО АЭС-МЦ ",2022]
[null,null,null,null,"ДАТЫ ПРОВЕРКИ",null,null,"ДАТЫ ПРЕ-ВИЗИТА",null,null,"ДАТЫ CPO"]
[null,"АЭС","Страна","Тип ПП","Начало","Окончание","Примечание","Начало","Окончание","Примечание","Начало","Окончание","Примечание","TL","Coord","Coord1","Cooud2","CPO TL","DIR","ExitRep","IndAdv","CPO","OA","OP","MA","EN","RP","OE","SOER","CY","TR","FP","EP"]
[null,"АЭС Богунице","Словакия","WPR5","2022-02-10","2022-02-25","Согласованы с АЭС","2021-11-08","2021-11-12",null,"cancelled","cancelled","FSC does \nnot work","Хаднадь","Аксёнов_С\nОтченашев",{"$f":"IF(ISNUMBER(SEARCH(\" \",O4)),LEFT(O4, SEARCH(\",\",O4,1)-1),O4)","v":"Аксёнов_С\nОтченашев"},{"$f":"IF(ISNUMBER(SEARCH(\" \",O4)),RIGHT(O4,LEN(O4)-SEARCH(\" \",O4)),\" \")","v":" "},"cancelled","Базарев","  ?","?","cancelled","Luke Sanna (AC)\nSergey Boyko","Alexandr Rybchuk\nKároly Vigh","Aleš Mlejnek\nMaxim Milyaev","Ingrid Brejchova\nPavel Kondratyev\nZsolt Herger","Dmitry Vinnikov","Dmitry Bazarev\nPC","Evgeny Kirilenko ","Minna Mäkinen","Mihail Sharov ","Nikolay Angelov","László Kovacsóczy\nVyacheslav Blyednykh"]
[null,"АЭС Моховце","Словакия","WPR5","2022-03-10","2022-03-25","Согласованы с АЭС","2021-09-27","2021-10-01",null,"2022-03-06","2022-03-16",null,"Рыбчук","Лачков\nБойковский",{"$f":"IF(ISNUMBER(SEARCH(\" \",O5)),LEFT(O5, SEARCH(\",\",O5,1)-1),O5)","v":"Лачков\nБойковский"},{"$f":"IF(ISNUMBER(SEARCH(\" \",O5)),RIGHT(O5,LEN(O5)-SEARCH(\" \",O5)),\" \")","v":" "},"Аксёнов_С\n","Ширзади\nАльмикеев коуч",null,null,null,"AC","Турилов",null,"PC",null,null,null,null,null,null,"TC"]
[null,"Курская АЭС","Россия","WPR5","2022-03-30","2022-04-15",null,"проведен","проведен",null,"2022-03-14","2022-03-25",null,"Дыроватый","Отченашев\nБазарев",null,null,"Шаров\nБазарев","Шкребтан\nБазарев"]
{"$rows_left_out":23}
{"sheet":"ГРАФИК ПП","index":1,"n_rows":31,"n_cols":382,"rows_kept":31,"cut":false,"hidden":false,"merged":[[2,290,2,320],[28,48,28,111],[2,321,2,350],[2,351,2,381],[2,17,2,47],[2,48,2,75],[2,76,2,106],[2,137,2,167],[2,168,2,197],[2,260,2,289],[29,48,29,111],[30,48,30,111],[2,198,2,228],[2,229,2,259],[1,5,1,6],[1,7,1,8],[1,9,1,10],[1,11,2,11]]}
[null,null,null,null,null,null,null,null,null,null,null,"ГРАФИК ПП ВАО АЭС-МЦ 2022"]
[null,null,null,null,null,"ДАТЫ ПРОВЕРКИ",null,"ДАТЫ ПРЕ-ВИЗИТА",null,"ДАТЫ CPO",null,"Период между ПП",null,null,null,null,null,"2022-01-01","2022-01-02","2022-01-03","2022-01-04","2022-01-05","2022-01-06","2022-01-07","2022-01-08","2022-01-09","2022-01-10","2022-01-11","2022-01-12","2022-01-13","2022-01-14","2022-01-15","2022-01-16","2022-01-17","2022-01-18","2022-01-19","2022-01-20","2022-01-21","2022-01-22","2022-01-23","2022-01-24","2022-01-25","2022-01-26","2022-01-27","2022-01-28","2022-01-29","2022-01-30","2022-01-31","2022-02-01","2022-02-02","2022-02-03","2022-02-04","2022-02-05","2022-02-06","2022-02-07","2022-02-08","2022-02-09","2022-02-10","2022-02-11","2022-02-12","2022-02-13","2022-02-14","2022-02-15","2022-02-16","2022-02-17","2022-02-18","2022-02-19","2022-02-20","2022-02-21","2022-02-22","2022-02-23","2022-02-24","2022-02-25","2022-02-26","2022-02-27","2022-02-28","2022-03-01","2022-03-02","2022-03-03","2022-03-04","2022-03-05","2022-03-06","2022-03-07","2022-03-08","2022-03-09","2022-03-10","2022-03-11","2022-03-12","2022-03-13","2022-03-14","2022-03-15","2022-03-16","2022-03-17","2022-03-18","2022-03-19","2022-03-20","2022-03-21","2022-03-22","2022-03-23","2022-03-24","2022-03-25","2022-03-26","2022-03-27","2022-03-28","2022-03-29","2022-03-30","2022-03-31","2022-04-01","2022-04-02","2022-04-03","2022-04-04","2022-04-05","2022-04-06","2022-04-07","2022-04-08","2022-04-09","2022-04-10","2022-04-11","2022-04-12","2022-04-13","2022-04-14","2022-04-15","2022-04-16","2022-04-17","2022-04-18","2022-04-19","2022-04-20","2022-04-21","2022-04-22","2022-04-23","2022-04-24","2022-04-25","2022-04-26","2022-04-27","2022-04-28","2022-04-29","2022-04-30","2022-05-01","2022-05-02","2022-05-03","2022-05-04","2022-05-05","2022-05-06","2022-05-07","2022-05-08","2022-05-09","2022-05-10","2022-05-11","2022-05-12","2022-05-13","2022-05-14","2022-05-15","2022-05-16","2022-05-17","2022-05-18","2022-05-19","2022-05-20","2022-05-21","2022-05-22","2022-05-23","2022-05-24","2022-05-25","2022-05-26","2022-05-27","2022-05-28","2022-05-29","2022-05-30","2022-05-31","2022-06-01","2022-06-02","2022-06-03","2022-06-04","2022-06-05","2022-06-06","2022-06-07","2022-06-08","2022-06-09","2022-06-10","2022-06-11","2022-06-12","2022-06-13","2022-06-14","2022-06-15","2022-06-16","2022-06-17","2022-06-18","2022-06-19","2022-06-20","2022-06-21","2022-06-22","2022-06-23","2022-06-24","2022-06-25","2022-06-26","2022-06-27","2022-06-28","2022-06-29","2022-06-30","2022-07-01","2022-07-02","2022-07-03","2022-07-04","2022-07-05","2022-07-06","2022-07-07","2022-07-08","2022-07-09","2022-07-10","2022-07-11","2022-07-12","2022-07-13","2022-07-14","2022-07-15","2022-07-16","2022-07-17","2022-07-18","2022-07-19","2022-07-20","2022-07-21","2022-07-22","2022-07-23","2022-07-24","2022-07-25","2022-07-26","2022-07-27","2022-07-28","2022-07-29","2022-07-30","2022-07-31","2022-08-01","2022-08-02","2022-08-03","2022-08-04","2022-08-05","2022-08-06","2022-08-07","2022-08-08","2022-08-09","2022-08-10","2022-08-11","2022-08-12","2022-08-13","2022-08-14","2022-08-15","2022-08-16","2022-08-17","2022-08-18","2022-08-19","2022-08-20","2022-08-21","2022-08-22","2022-08-23","2022-08-24","2022-08-25","2022-08-26","2022-08-27","2022-08-28","2022-08-29","2022-08-30","2022-08-31","2022-09-01","2022-09-02","2022-09-03","2022-09-04","2022-09-05","2022-09-06","2022-09-07","2022-09-08","2022-09-09","2022-09-10","2022-09-11","2022-09-12","2022-09-13","2022-09-14","2022-09-15","2022-09-16","2022-09-17","2022-09-18","2022-09-19","2022-09-20","2022-09-21","2022-09-22","2022-09-23","2022-09-24","2022-09-25","2022-09-26","2022-09-27","2022-09-28","2022-09-29","2022-09-30","2022-10-01","2022-10-02","2022-10-03","2022-10-04","2022-10-05","2022-10-06","2022-10-07","2022-10-08","2022-10-09","2022-10-10","2022-10-11","2022-10-12","2022-10-13","2022-10-14","2022-10-15","2022-10-16","2022-10-17","2022-10-18","2022-10-19","2022-10-20","2022-10-21","2022-10-22","2022-10-23","2022-10-24","2022-10-25","2022-10-26","2022-10-27","2022-10-28","2022-10-29","2022-10-30","2022-10-31","2022-11-01","2022-11-02","2022-11-03","2022-11-04","2022-11-05","2022-11-06","2022-11-07","2022-11-08","2022-11-09","2022-11-10","2022-11-11","2022-11-12","2022-11-13","2022-11-14","2022-11-15","2022-11-16","2022-11-17","2022-11-18","2022-11-19","2022-11-20","2022-11-21","2022-11-22","2022-11-23","2022-11-24","2022-11-25","2022-11-26","2022-11-27","2022-11-28","2022-11-29","2022-11-30","2022-12-01","2022-12-02","2022-12-03","2022-12-04","2022-12-05","2022-12-06","2022-12-07","2022-12-08","2022-12-09","2022-12-10","2022-12-11","2022-12-12","2022-12-13","2022-12-14","2022-12-15","2022-12-16","2022-12-17","2022-12-18","2022-12-19","2022-12-20","2022-12-21","2022-12-22","2022-12-23","2022-12-24","2022-12-25","2022-12-26","2022-12-27","2022-12-28","2022-12-29","2022-12-30","2022-12-31"]
[null,"АЭС","Страна","Тип ПП","Кат-ия","Начало","Окончание","Начало","Окончание","Начало","Окончание",null,"TL","Coord1","Coord2","CPO  TL","DIR","Январь",null,null,null,null,null,null,null,null,null,null,null,null,null,null,null,null,null,null,null,null,null,null,null,null,null,null,null,null,null,null,"Февраль",null,null,null,null,null,null,null,null,null,null,null,null,null,null,null,null,null,null,null,null,null,null,null,null,null,null,null,"Март",null,null,null,null,null,null,null,null,null,null,null,null,null,null,null,null,null,null,null,null,null,null,null,null,null,null,null,null,null,null,"Апрель",null,null,null,null,null,null,null,null,null,null,null,null,null,null,null,null,null,null,null,null,null,null,null,null,null,null,null,null,null,"Май",null,null,null,null,null,null,null,null,null,null,null,null,null,null,null,null,null,null,null,null,null,null,null,null,null,null,null,null,null,null,"Июнь",null,null,null,null,null,null,null,null,null,null,null,null,null,null,null,null,null,null,null,null,null,null,null,null,null,null,null,null,null,"Июль",null,null,null,null,null,null,null,null,null,null,null,null,null,null,null,null,null,null,null,null,null,null,null,null,null,null,null,null,null,null,"Август",null,null,null,null,null,null,null,null,null,null,null,null,null,null,null,null,null,null,null,null,null,null,null,null,null,null,null,null,null,null,"Сентябрь",null,null,null,null,null,null,null,null,null,null,null,null,null,null,null,null,null,null,null,null,null,null,null,null,null,null,null,null,null,"Октябрь",null,null,null,null,null,null,null,null,null,null,null,null,null,null,null,null,null,null,null,null,null,null,null,null,null,null,null,null,null,null,"Нобярь",null,null,null,null,null,null,null,null,null,null,null,null,null,null,null,null,null,null,null,null,null,null,null,null,null,null,null,null,null,"Декабрь"]
[null,"АЭС Богунице","Словакия","WPR5","B",{"$f":"VLOOKUP($B4,'КОМАНДЫ ПП'!$B$4:$S$28,4,0)","v":"2022-02-10"},{"$f":"VLOOKUP($B4,'КОМАНДЫ ПП'!$B$4:$S$28,5,0)","v":"2022-02-25"},{"$f":"VLOOKUP($B4,'КОМАНДЫ ПП'!$B$4:$S$28,7,0)","v":"2021-11-08"},{"$f":"VLOOKUP($B4,'КОМАНДЫ ПП'!$B$4:$S$28,8,0)","v":"2021-11-12"},{"$f":"VLOOKUP($B4,'КОМАНДЫ ПП'!$B$4:$S$28,10,0)","v":"cancelled"},{"$f":"VLOOKUP($B4,'КОМАНДЫ ПП'!$B$4:$S$28,11,0)","v":"cancelled"},{"$f":"VLOOKUP($B4,'ПЛАН ПП (2)'!$B$4:$AF$30,31,0)","v":"52 мес., 27 дн."},{"$f":"VLOOKUP($B4,'КОМАНДЫ ПП'!$B$4:$S$28,13,0)","v":"Хаднадь"},{"$f":"VLOOKUP($B4,'КОМАНДЫ ПП'!$B$4:$S$28,15,0)","v":"Аксёнов_С\nОтченашев"},{"$f":"VLOOKUP($B4,'КОМАНДЫ ПП'!$B$4:$S$28,16,0)","v":" "},{"$f":"VLOOKUP($B4,'КОМАНДЫ ПП'!$B$4:$S$28,17,0)","v":"cancelled"},{"$f":"VLOOKUP($B4,'КОМАНДЫ ПП'!$B$4:$S$28,18,0)","v":"Базарев"}," "]
[null,"АЭС Моховце","Словакия","WPR5","C",{"$f":"VLOOKUP($B5,'КОМАНДЫ ПП'!$B$4:$S$28,4,0)","v":"2022-03-10"},{"$f":"VLOOKUP($B5,'КОМАНДЫ ПП'!$B$4:$S$28,5,0)","v":"2022-03-25"},{"$f":"VLOOKUP($B5,'КОМАНДЫ ПП'!$B$4:$S$28,7,0)","v":"2021-09-27"},{"$f":"VLOOKUP($B5,'КОМАНДЫ ПП'!$B$4:$S$28,8,0)","v":"2021-10-01"},{"$f":"VLOOKUP($B5,'КОМАНДЫ ПП'!$B$4:$S$28,10,0)","v":"2022-03-06"},{"$f":"VLOOKUP($B5,'КОМАНДЫ ПП'!$B$4:$S$28,11,0)","v":"2022-03-16"},{"$f":"VLOOKUP($B5,'ПЛАН ПП (2)'!$B$4:$AF$30,31,0)","v":"47 мес., 23 дн."},{"$f":"VLOOKUP($B5,'КОМАНДЫ ПП'!$B$4:$S$28,13,0)","v":"Рыбчук"},{"$f":"VLOOKUP($B5,'КОМАНДЫ ПП'!$B$4:$S$28,15,0)","v":"Лачков\nБойковский"},{"$f":"VLOOKUP($B5,'КОМАНДЫ ПП'!$B$4:$S$28,16,0)","v":" "},{"$f":"VLOOKUP($B5,'КОМАНДЫ ПП'!$B$4:$S$28,17,0)","v":"Аксёнов_С\n"},{"$f":"VLOOKUP($B5,'КОМАНДЫ ПП'!$B$4:$S$28,18,0)","v":"Ширзади\nАльмикеев коуч"}," "]
[null,"ФГУП “Атомфлот”","Россия","WPR5","B",{"$f":"VLOOKUP($B6,'КОМАНДЫ ПП'!$B$4:$S$28,4,0)","v":"2022-09-29"},{"$f":"VLOOKUP($B6,'КОМАНДЫ ПП'!$B$4:$S$28,5,0)","v":"2022-10-14"},{"$f":"VLOOKUP($B6,'КОМАНДЫ ПП'!$B$4:$S$28,7,0)","v":"00:00:00"},{"$f":"VLOOKUP($B6,'КОМАНДЫ ПП'!$B$4:$S$28,8,0)","v":"00:00:00"},{"$f":"VLOOKUP($B6,'КОМАНДЫ ПП'!$B$4:$S$28,10,0)","v":"00:00:00"},{"$f":"VLOOKUP($B6,'КОМАНДЫ ПП'!$B$4:$S$28,11,0)","v":"00:00:00"},{"$f":"VLOOKUP($B6,'ПЛАН ПП (2)'!$B$4:$AF$30,31,0)","v":"46 мес., 2 дн."},{"$f":"VLOOKUP($B6,'КОМАНДЫ ПП'!$B$4:$S$28,13,0)","v":"Шаров"},{"$f":"VLOOKUP($B6,'КОМАНДЫ ПП'!$B$4:$S$28,15,0)","v":"Хромовских"},{"$f":"VLOOKUP($B6,'КОМАНДЫ ПП'!$B$4:$S$28,16,0)","v":" "},{"$f":"VLOOKUP($B6,'КОМАНДЫ ПП'!$B$4:$S$28,17,0)","v":"Базарев"},{"$f":"VLOOKUP($B6,'КОМАНДЫ ПП'!$B$4:$S$28,18,0)","v":"Хромовских"}," "]
{"$rows_left_out":26}
{"sheet":"КОМАНДЫ ПП РАСЧ","index":2,"n_rows":28,"n_cols":29,"rows_kept":28,"cut":false,"hidden":true,"merged":[[1,5,1,6],[1,7,1,8],[1,9,1,10]]}
[null,{"$f":"'КОМАНДЫ ПП'!L1","v":2022}]
[null,null,null,null,null,"ДАТЫ ПРОВЕРКИ",null,"ДАТЫ ПРЕ-ВИЗИТА",null,"ДАТЫ CPO"]
[null,"АЭС","Страна","Тип ПП","НМ","Начало","Окончание","Начало","Окончание","Начало","Окончание","TL","Coord","CPO TL","DIR","ExitRep","IndAdv","CPO","OA","OP","MA","EN","RP","OE","SOER","CY","TR","FP","EP"]
[null,"АЭС Пакш","Венгрия","WPR5",{"$f":"CONCATENATE(B4,\", \",D4,\", TL: \",L4,\", CC: \",M4,\", \",#REF!)","v":{"$error":"#REF!"}},{"$f":"IF('ГРАФИК ПП'!F4>0,'ГРАФИК ПП'!F4,\" \")","v":"2022-02-10"},{"$f":"IF('ГРАФИК ПП'!G4>0,'ГРАФИК ПП'!G4,\" \")","v":"2022-02-25"},{"$f":"IF('ГРАФИК ПП'!H4>0,'ГРАФИК ПП'!H4,\" \")","v":"2021-11-08"},{"$f":"IF('ГРАФИК ПП'!I4>0,'ГРАФИК ПП'!I4,\" \")","v":"2021-11-12"},{"$f":"IF('ГРАФИК ПП'!$J4=\"TBD\",$F4,IF('ГРАФИК ПП'!$J4>0,'ГРАФИК ПП'!$J4,\" \"))","v":"cancelled"},{"$f":"IF('ГРАФИК ПП'!K4>0,'ГРАФИК ПП'!K4,\" \")","v":"cancelled"},{"$f":"IF(YEAR($F4)=$B$1,'ГРАФИК ПП'!$M4,0)","v":"Хаднадь"},{"$f":"IF(YEAR($F4)=$B$1,CONCATENATE('ГРАФИК ПП'!N4,\", \",'ГРАФИК ПП'!O4),0)","v":"Аксёнов_С\nОтченашев,  "},{"$f":"IF(YEAR($J4)=$B$1,'КОМАНДЫ ПП'!$R4,0)","v":{"$error":"#VALUE!"}},{"$f":"'ГРАФИК ПП'!Q4","v":"Базарев"},{"$f":"'КОМАНДЫ ПП'!T4","v":"  ?"},{"$f":"'КОМАНДЫ ПП'!U4","v":"?"},{"$f":"IF(YEAR($J4)=$B$1,'КОМАНДЫ ПП'!$V4,0)","v":{"$error":"#VALUE!"}},{"$f":"'КОМАНДЫ ПП'!W4","v":"Luke Sanna (AC)\nSergey Boyko"},{"$f":"'КОМАНДЫ ПП'!X4","v":"Alexandr Rybchuk\nKároly Vigh"},{"$f":"'КОМАНДЫ ПП'!Y4","v":"Aleš Mlejnek\nMaxim Milyaev"},{"$f":"'КОМАНДЫ ПП'!Z4","v":"Ingrid Brejchova\nPavel Kondratyev\nZsolt Herger"},{"$f":"'КОМАНДЫ ПП'!AA4","v":"Dmitry Vinnikov"},{"$f":"'КОМАНДЫ ПП'!AB4","v":"Dmitry Bazarev\nPC"},{"$f":"'КОМАНДЫ ПП'!AC4","v":"Evgeny Kirilenko "},{"$f":"'КОМАНДЫ ПП'!AD4","v":"Minna Mäkinen"},{"$f":"'КОМАНДЫ ПП'!AE4","v":"Mihail Sharov "},{"$f":"'КОМАНДЫ ПП'!AF4","v":"Nikolay Angelov"},{"$f":"'КОМАНДЫ ПП'!AG4","v":"László Kovacsóczy\nVyacheslav Blyednykh"}]
[null,"Белоярская АЭС","Россия","WPR5",{"$f":"CONCATENATE(B5,\", \",D5,\", TL: \",L5,\", CC: \",M5,\", \",#REF!)","v":{"$error":"#REF!"}},{"$f":"IF('ГРАФИК ПП'!F5>0,'ГРАФИК ПП'!F5,\" \")","v":"2022-03-10"},{"$f":"IF('ГРАФИК ПП'!G5>0,'ГРАФИК ПП'!G5,\" \")","v":"2022-03-25"},{"$f":"IF('ГРАФИК ПП'!H5>0,'ГРАФИК ПП'!H5,\" \")","v":"2021-09-27"},{"$f":"IF('ГРАФИК ПП'!I5>0,'ГРАФИК ПП'!I5,\" \")","v":"2021-10-01"},{"$f":"IF('ГРАФИК ПП'!$J5=\"TBD\",$F5,IF('ГРАФИК ПП'!$J5>0,'ГРАФИК ПП'!$J5,\" \"))","v":"2022-03-06"},{"$f":"IF('ГРАФИК ПП'!K5>0,'ГРАФИК ПП'!K5,\" \")","v":"2022-03-16"},{"$f":"IF(YEAR($F5)=$B$1,'ГРАФИК ПП'!$M5,0)","v":"Рыбчук"},{"$f":"IF(YEAR($F5)=$B$1,CONCATENATE('ГРАФИК ПП'!N5,\", \",'ГРАФИК ПП'!O5),0)","v":"Лачков\nБойковский,  "},{"$f":"IF(YEAR($J5)=$B$1,'КОМАНДЫ ПП'!$R5,0)","v":"Аксёнов_С\n"},{"$f":"'ГРАФИК ПП'!Q5","v":"Ширзади\nАльмикеев коуч"},{"$f":"'КОМАНДЫ ПП'!T5","v":0},{"$f":"'КОМАНДЫ ПП'!U5","v":0},{"$f":"IF(YEAR($J5)=$B$1,'КОМАНДЫ ПП'!$V5,0)","v":0},{"$f":"'КОМАНДЫ ПП'!W5","v":"AC"},{"$f":"'КОМАНДЫ ПП'!X5","v":"Турилов"},{"$f":"'КОМАНДЫ ПП'!Y5","v":0},{"$f":"'КОМАНДЫ ПП'!Z5","v":"PC"},{"$f":"'КОМАНДЫ ПП'!AA5","v":0},{"$f":"'КОМАНДЫ ПП'!AB5","v":0},{"$f":"'КОМАНДЫ ПП'!AC5","v":0},{"$f":"'КОМАНДЫ ПП'!AD5","v":0},{"$f":"'КОМАНДЫ ПП'!AE5","v":0},{"$f":"'КОМАНДЫ ПП'!AF5","v":0},{"$f":"'КОМАНДЫ ПП'!AG5","v":"TC"}]
[null,"АЭС Дукованы","Чехия ","WPR5",{"$f":"CONCATENATE(B6,\", \",D6,\", TL: \",L6,\", CC: \",M6,\", \",#REF!)","v":{"$error":"#REF!"}},{"$f":"IF('ГРАФИК ПП'!F6>0,'ГРАФИК ПП'!F6,\" \")","v":"2022-09-29"},{"$f":"IF('ГРАФИК ПП'!G6>0,'ГРАФИК ПП'!G6,\" \")","v":"2022-10-14"},{"$f":"IF('ГРАФИК ПП'!H6>0,'ГРАФИК ПП'!H6,\" \")","v":" "},{"$f":"IF('ГРАФИК ПП'!I6>0,'ГРАФИК ПП'!I6,\" \")","v":" "},{"$f":"IF('ГРАФИК ПП'!$J6=\"TBD\",$F6,IF('ГРАФИК ПП'!$J6>0,'ГРАФИК ПП'!$J6,\" \"))","v":" "},{"$f":"IF('ГРАФИК ПП'!K6>0,'ГРАФИК ПП'!K6,\" \")","v":" "},{"$f":"IF(YEAR($F6)=$B$1,'ГРАФИК ПП'!$M6,0)","v":"Шаров"},{"$f":"IF(YEAR($F6)=$B$1,CONCATENATE('ГРАФИК ПП'!N6,\", \",'ГРАФИК ПП'!O6),0)","v":"Хромовских,  "},{"$f":"IF(YEAR($J6)=$B$1,'КОМАНДЫ ПП'!$R7,0)","v":{"$error":"#VALUE!"}},{"$f":"'ГРАФИК ПП'!Q6","v":"Хромовских"},{"$f":"'КОМАНДЫ ПП'!T7","v":0},{"$f":"'КОМАНДЫ ПП'!U7","v":0},{"$f":"IF(YEAR($J6)=$B$1,'КОМАНДЫ ПП'!$V7,0)","v":{"$error":"#VALUE!"}},{"$f":"'КОМАНДЫ ПП'!W7","v":0},{"$f":"'КОМАНДЫ ПП'!X7","v":0},{"$f":"'КОМАНДЫ ПП'!Y7","v":0},{"$f":"'КОМАНДЫ ПП'!Z7","v":0},{"$f":"'КОМАНДЫ ПП'!AA7","v":0},{"$f":"'КОМАНДЫ ПП'!AB7","v":0},{"$f":"'КОМАНДЫ ПП'!AC7","v":0},{"$f":"'КОМАНДЫ ПП'!AD7","v":0},{"$f":"'КОМАНДЫ ПП'!AE7","v":0},{"$f":"'КОМАНДЫ ПП'!AF7","v":0},{"$f":"'КОМАНДЫ ПП'!AG7","v":0}]
{"$rows_left_out":23}
{"sheet":"ЗАГРУЖЕННОСТЬ","index":3,"n_rows":24,"n_cols":12,"rows_kept":24,"cut":false,"hidden":false,"merged":[]}
[]
[null,"Фамилия",null,"Всего мероприятий","Участие в ПП, ПППП на станциях МЦ в качестве CO&TL","Участие в  ППП на станциях МЦ в качестве CO&TL","Участие в ПП, ППП, ПППП на станциях МЦ в качестве CPO TL","Участие в ПП, ППП, ПППП на станциях МЦ в качестве экспертов","АНАЛИЗ DIR","Участие в ПП других РЦ","Участие в КПП","Другие мероприятия"]
[null,"Зинченко",{"$f":"\"*\"&B3&\"*\"","v":"*Зинченко*"},{"$f":"SUM(E3:L3)","v":0},{"$f":"COUNTIF('КОМАНДЫ ПП РАСЧ'!$L$4:$M$20,$C3)","v":0},{"$f":"COUNTIF('КОМАНДЫ ПП РАСЧ'!$L$21:$M$28,$C3)","v":0},{"$f":"COUNTIF('КОМАНДЫ ПП РАСЧ'!$N$4:$N$20,$C3)","v":0},{"$f":"COUNTIF('КОМАНДЫ ПП РАСЧ'!$R$4:$AC$28,$C3)","v":0},{"$f":"COUNTIF('ГРАФИК ПП'!$Q$4:$Q$27,$C3)","v":0}]
[null,"Аксёнов_С",{"$f":"\"*\"&B4&\"*\"","v":"*Аксёнов_С*"},{"$f":"SUM(E4:L4)","v":2},{"$f":"COUNTIF('КОМАНДЫ ПП РАСЧ'!$L$4:$M$20,$C4)","v":1},{"$f":"COUNTIF('КОМАНДЫ ПП РАСЧ'!$L$21:$M$28,$C4)","v":0},{"$f":"COUNTIF('КОМАНДЫ ПП РАСЧ'!$N$4:$N$20,$C4)","v":1},{"$f":"COUNTIF('КОМАНДЫ ПП РАСЧ'!$R$4:$AC$28,$C4)","v":0},{"$f":"COUNTIF('ГРАФИК ПП'!$Q$4:$Q$27,$C4)","v":0}]
[null,"Альмикеев",{"$f":"\"*\"&B5&\"*\"","v":"*Альмикеев*"},5,{"$f":"COUNTIF('КОМАНДЫ ПП РАСЧ'!$L$4:$M$20,$C5)","v":1},{"$f":"COUNTIF('КОМАНДЫ ПП РАСЧ'!$L$21:$M$28,$C5)","v":1},{"$f":"COUNTIF('КОМАНДЫ ПП РАСЧ'!$N$4:$N$20,$C5)","v":0},{"$f":"COUNTIF('КОМАНДЫ ПП РАСЧ'!$R$4:$AC$28,$C5)","v":0},{"$f":"COUNTIF('ГРАФИК ПП'!$Q$4:$Q$27,$C5)","v":3}]
[null,"Базарев","*Базарев*",5,{"$f":"COUNTIF('КОМАНДЫ ПП РАСЧ'!$L$4:$M$20,$C6)","v":0},{"$f":"COUNTIF('КОМАНДЫ ПП РАСЧ'!$L$21:$M$28,$C6)","v":0},{"$f":"COUNTIF('КОМАНДЫ ПП РАСЧ'!$N$4:$N$20,$C6)","v":1},{"$f":"COUNTIF('КОМАНДЫ ПП РАСЧ'!$R$4:$AC$28,$C6)","v":1},{"$f":"COUNTIF('ГРАФИК ПП'!$Q$4:$Q$27,$C6)","v":3}]
{"$rows_left_out":19}
{"sheet":"ПЛАН ПП","index":4,"n_rows":30,"n_cols":27,"rows_kept":30,"cut":false,"hidden":true,"merged":[[1,20,1,21],[1,22,2,22],[1,23,1,24],[1,25,2,25],[1,26,2,26],[1,19,2,19],[0,0,0,18],[1,0,2,0],[1,1,2,1],[1,2,1,3],[1,4,2,4],[1,5,1,6],[1,7,2,7],[1,8,1,9],[1,10,2,10],[1,11,2,11],[1,12,1,13],[1,14,2,14],[1,15,1,16],[1,17,2,17],[1,18,2,18]]}
["8 летний график планирования проведения ПП\n(требоавния WPG 01)"]
["№","АЭС","Даты ПП",null,"Начало ППП согласно WPG 01","Даты ППП",null,"Начало след ПП согласно WPG01 ","Даты ПП",null,"Фактическое кол-во месяцев и дней между двумя ПП","Начало ППП согласно WPG 01","Даты ППП",null,"Начало след ПП согласно WPG01 ","Даты ПП",null,"Фактическое кол-во месяцев и дней между двумя ПП","Среднее кол-во месяцев и дней между тремя ПП","Начало ППП согласно WPG 01","Даты ППП",null,"Начало след ПП согласно WPG01 ","Даты ПП",null,"Фактическое кол-во месяцев и дней между двумя ПП","Среднее кол-во месяцев и дней между тремя ПП"]
[null,null,"Начало","Окончание",null,"Начало","Окончание",null,"Начало","Окончание",null,null,"Начало","Окончание",null,"Начало","Окончание",null,null,null,"Начало","Окончание",null,"Начало","Окончание"]
[1,"АЭС Пакш","2016-02-18","2016-03-04",{"$f":"D4+((H4-D4)/2)","v":"2018-02-25"},null,null,{"$f":"EDATE(C4,48)","v":"2020-02-18"},"2021-02-17","2021-03-05",{"$f":"IF(I4>0,DATEDIF(C4,I4,\"m\")&\" мес., \"&DATEDIF(C4,I4,\"md\")&\" дн.\",\" \")","v":"59 мес., 30 дн."},{"$f":"IF(J4>0,J4+((O4-J4)/2),\" \")","v":"2022-08-27"},null,null,{"$f":"IF(I4>0,IF(OR(EDATE(C4,48)<EDATE(I4,0),I4=0),EDATE(C4,96),EDATE(I4,48)),\" \")","v":"2024-02-18"},null,null,{"$f":"IF(P4>0,DATEDIF(I4,P4,\"m\")&\" мес., \"&DATEDIF(I4,P4,\"md\")&\" дн.\",\" \")","v":" "},{"$f":"IF(P4>0,DATEDIF(C4,P4,\"m\")/2&\" мес., \"&DATEDIF(C4,P4,\"md\")/2&\" дн.\",\" \")","v":" "},{"$f":"IF(Q4>0,Q4+((W4-Q4)/2),\" \")","v":" "},null,null,{"$f":"IF(P4>0,IF(OR(EDATE(I4,48)<EDATE(P4,0),P4=0),EDATE(I4,96),EDATE(P4,48)),\" \")","v":" "},null,null,{"$f":"IF(X4>0,DATEDIF(P4,X4,\"m\")&\" мес., \"&DATEDIF(P4,X4,\"md\")&\" дн.\",\" \")","v":" "},{"$f":"IF(X4>0,DATEDIF(I4,X4,\"m\")/2&\" мес., \"&DATEDIF(I4,X4,\"md\")/2&\" дн.\",\" \")","v":" "}]
[2,"Белоярская АЭС","2016-08-18","2016-09-02",{"$f":"D5+((H5-D5)/2)","v":"2018-08-26"},null,null,"2020-08-18","2021-03-25","2021-04-09",{"$f":"IF(I5>0,DATEDIF(C5,I5,\"m\")&\" мес., \"&DATEDIF(C5,I5,\"md\")&\" дн.\",\" \")","v":"55 мес., 7 дн."},"2022-12-13T12:00:00",null,null,{"$f":"IF(I5>0,IF(OR(EDATE(C5,48)<EDATE(I5,0),I5=0),EDATE(C5,96),EDATE(I5,48)),\" \")","v":"2024-08-18"},null,null,{"$f":"IF(P5>0,DATEDIF(I5,P5,\"m\")&\" мес., \"&DATEDIF(I5,P5,\"md\")&\" дн.\",\" \")","v":" "},{"$f":"IF(P5>0,DATEDIF(C5,P5,\"m\")/2&\" мес., \"&DATEDIF(C5,P5,\"md\")/2&\" дн.\",\" \")","v":" "},{"$f":"IF(Q5>0,Q5+((W5-Q5)/2),\" \")","v":" "},null,null,{"$f":"IF(P5>0,IF(OR(EDATE(I5,48)<EDATE(P5,0),P5=0),EDATE(I5,96),EDATE(P5,48)),\" \")","v":" "},null,null,{"$f":"IF(X5>0,DATEDIF(P5,X5,\"m\")&\" мес., \"&DATEDIF(P5,X5,\"md\")&\" дн.\",\" \")","v":" "},{"$f":"IF(X5>0,DATEDIF(I5,X5,\"m\")/2&\" мес., \"&DATEDIF(I5,X5,\"md\")/2&\" дн.\",\" \")","v":" "}]
[3,"Запорожская АЭС","2016-10-06","2016-10-21","2018-10-14",null,null,"2020-10-06","2021-05-13","2021-05-28","55 мес., 7 дн.","2023-01-31T12:00:00",null,null,"2024-10-06",null,null," "," "," ",null,null," ",null,null," "," "]
{"$rows_left_out":25}
{"sheet":"ПЛАН ПП (2)","index":5,"n_rows":30,"n_cols":32,"rows_kept":30,"cut":false,"hidden":false,"merged":[[1,18,1,19],[1,20,1,21],[1,31,2,31],[1,0,2,0],[1,1,2,1],[1,26,1,27],[1,28,2,28],[1,29,1,30],[1,24,1,25],[1,22,1,23],[1,10,1,11],[1,2,1,3],[1,4,1,5],[1,6,1,7],[1,14,1,15],[1,8,1,9],[1,12,1,13],[1,16,1,17]]}
["8 летний график планирования проведения ПП"]
["№","АЭС","Даты WPR1",null,"Даты F-Up WPR1",null,"Даты WPR2",null,"Даты F-Up WPR2",null,"Даты WPR3",null,"Даты F-Up WPR3",null,"Даты WPR4",null,"Даты F-Up WPR4",null,"Даты WPR5",null,"Даты F-Up WPR5",null,"Даты WPR6",null,"Даты F-Up WPR6",null,"Даты ПП",null,"План. след ПП согласно WPG01 ","Даты ПП",null,"Фактическое кол-во месяцев и дней между двумя ПП"]
[null,null,"Начало","Окончание","Начало","Окончание","Начало","Окончание","Начало","Окончание","Начало","Окончание","Начало","Окончание","Начало","Окончание","Начало","Окончание","Начало","Окончание","Начало","Окончание","Начало","Окончание","Начало","Окончание","Начало","Окончание",null,"Начало","Окончание"]
[1,"АЭС Пакш",null,null,null,null,null,null,null,null,null,null,null,null,"2016-02-18","2016-03-04",null,null,"2021-02-17","2021-03-05",null,null,null,null,null,null,"2016-02-18","2016-03-04",{"$f":"EDATE(O4,48)","v":"2020-02-18"},"2021-02-17","2021-03-05",{"$f":"IF(S4>0,DATEDIF(O4,S4,\"m\")&\" мес., \"&DATEDIF(O4,S4,\"md\")&\" дн.\",\" \")","v":"59 мес., 30 дн."}]
[2,"Белоярская АЭС",null,null,null,null,null,null,null,null,null,null,null,null,"2016-08-18","2016-09-02",null,null,"2021-03-25","2021-04-09",null,null,null,null,null,null,"2016-08-18","2016-09-02","2020-08-18","2021-03-25","2021-04-09","55 мес., 7 дн."]
[3,"Запорожская АЭС",null,null,null,null,null,null,null,null,null,null,null,null,"2016-10-06","2016-10-21",null,null,"2021-05-13","2021-05-28",null,null,null,null,null,null,"2016-10-06","2016-10-21","2020-10-06","2021-05-13","2021-05-28","55 мес., 7 дн."]
{"$rows_left_out":24}