{"text_format":"1","workbook":"xlsx","n_sheets":6,"sheets":["КОМАНДЫ ПП","ГРАФИК ПП","КОМАНДЫ ПП РАСЧ","ЗАГРУЖЕННОСТЬ","ПЛАН ПП","ПЛАН ПП (2)"],"not_rendered":{"charts":0,"images":0,"macros":1,"external_links":0,"defined_names":8,"comments":2,"pivot_tables":0},"unopened":[],"bounds":{"document_bytes":16777216,"sheet_cells":100000,"rows_first":2000,"rows_last":500,"rows_between":2000,"halvings":0,"cell_chars":16384,"cell_head_chars":4096},"cells_cut":0,"cells_raw":0,"read":"whole","date_system":"1900"}

{"sheet":"КОМАНДЫ ПП","index":0,"n_rows":28,"n_cols":33,"rows_kept":28,"cut":false,"hidden":false,"merged":[[1,4,1,6],[1,7,1,9],[1,10,1,12]]}
[null,null,null,null,null,null,null,null,null,null,"ПАРТНЕРСКИЕ ПРОВЕРКИ ВАО АЭС-МЦ ",2022]
[null,null,null,null,"ДАТЫ ПРОВЕРКИ",null,null,"ДАТЫ ПРЕ-ВИЗИТА",null,null,"ДАТЫ CPO"]
[null,"АЭС","Страна","Тип ПП","Начало","Окончание","Примечание","Начало","Окончание","Примечание","Начало","Окончание","Примечание","TL","Coord","Coord1","Cooud2","CPO TL","DIR","ExitRep","IndAdv","CPO","OA","OP","MA","EN","RP","OE","SOER","CY","TR","FP","EP"]
[null,"АЭС Богунице","Словакия","WPR5","2022-02-10","2022-02-25","Согласованы с АЭС","2021-11-08","2021-11-12",null,"cancelled","cancelled","FSC does \nnot work","Хаднадь","Аксёнов_С\nОтченашев",{"$f":"IF(ISNUMBER(SEARCH(\" \",O4)),LEFT(O4, SEARCH(\",\",O4,1)-1),O4)","v":"Аксёнов_С\nОтченашев"},{"$f":"IF(ISNUMBER(SEARCH(\" \",O4)),RIGHT(O4,LEN(O4)-SEARCH(\" \",O4)),\" \")","v":" "},"cancelled","Базарев","  ?","?","cancelled","Luke Sanna (AC)\nSergey Boyko","Alexandr Rybchuk\nKároly Vigh","Aleš Mlejnek\nMaxim Milyaev","Ingrid Brejchova\nPavel Kondratyev\nZsolt Herger","Dmitry Vinnikov","Dmitry Bazarev\nPC","Evgeny Kirilenko ","Minna Mäkinen","Mihail Sharov ","Nikolay Angelov","László Kovacsóczy\nVyacheslav Blyednykh"]
[null,"АЭС Моховце","Словакия","WPR5","2022-03-10","2022-03-25","Согласованы с АЭС","2021-09-27","2021-10-01",null,"2022-03-06","2022-03-16",null,"Рыбчук","Лачков\nБойковский",{"$f":"IF(ISNUMBER(SEARCH(\" \",O5)),LEFT(O5, SEARCH(\",\",O5,1)-1),O5)","v":"Лачков\nБойковский"},{"$f":"IF(ISNUMBER(SEARCH(\" \",O5)),RIGHT(O5,LEN(O5)-SEARCH(\" \",O5)),\" \")","v":" "},"Аксёнов_С\n","Ширзади\nАльмикеев коуч",null,null,null,"AC","Турилов",null,"PC",null,null,null,null,null,null,"TC"]
[null,"Курская АЭС","Россия","WPR5","2022-03-30","2022-04-15",null,"проведен","проведен",null,"2022-03-14","2022-03-25",null,"Дыроватый","Отченашев\nБазарев",null,null,"Шаров\nБазарев","Шкребтан\nБазарев"]
[null,"ФГУП “Атомфлот”","Россия","WPR5","2022-09-29","2022-10-14","Предлагаемая",null,null,null,null,null,null,"Шаров","Хромовских","Хромовских"," ","Базарев","Хромовских"]
[null,"ПАТЭС \"Академик Ломоносов\"","Россия","WPR1","2022-08-04","2022-08-19","Предлагаемая","2022-03-21","2022-03-25",null,null,null,null,"???\nГрунда","Рыбаков","Рыбаков"," "," Шаров","Базарев"]
[null,"Ленинградская АЭС","Россия","WPR5","2022-08-11","2022-08-27","Согласованы с АЭС","2022-02-14","2022-02-18",null,"2022-04-18","2022-04-29",null,"Дыроватый","Альмикеев\nШирзади","Альмикеев\nШирзади"," ","Рыбчук\nБазарев","Альмикеев"]
[null,"Армянская АЭС","Армения","WPR5","2022-08-25","2022-09-10","Согласованы с АЭС","2022-04-25","2022-04-29",null,null,null,null,"Бойковский","Лачков\nКенджецян","Лачков\nКенджецян"," ","Васильчук","Альмикеев"]
[null,"Калининская АЭС","Россия","WPR6","2022-10-06","2022-10-21","Согласованы с АЭС","2022-04-25","2022-04-29",null,"2022-10-03","2022-10-14",null,"Креницкий?","Хромовских\nЩелик","Хромовских\nЩелик"," ","Шаров","Хромовских"]
[null,"Ростовская АЭС","Россия","WPR5","2022-11-10","2022-11-25","Согласованыс АЭС","2022-07-18","2022-07-22",null,null,null,null,"Бойковский\nГрунда?","Отченашев\nКопылов\n","Отченашев\nКопылов\n"," ","Дыроватый","Базарев"]
[null,null,null,"WPR5",null,null,null,null,null,null,null,null,null,null,null,0]
[null,null,null,"WPR5",null,null,null,null,null,null,null,null,null,null,null,0]
[null,null,null,"WPR5",null,null,null,null,null,null,null,null,null,null,null,0]
[null,null,null,"WPR6",null,null,null,null,null,null,null,null,null,null,null,0]
[null,"Моховце-4","Словакия","PSUR","01.12.2022?","2022-12-28","Ожидаемый",null,null,null,null,null,null,"Баджио","Альмикеев","Альмикеев"]
[null,"Атомфлот, УАЛ \"Урал\"","Россия","PSUR","01.12.2022?","2022-12-28","Ожидаемый",null,null,null,null,null,null,"Рыбчук",null,0]
[null,null,null,"PSUR",null,null,null,null,null,null,null,null,null,null,null,0]
[null,null,null,"PSUR",null,null,null,null,null,null,null,null,null,null,null,0]
[null,"Куданкулам ","Индия","F-Up","2022-02-07","2022-02-11","Предполагаемые даты",null,null,null,null,null,null,null,"Лачков","Лачков"]
[null,"Бушер","Иран","F-Up","2022-01-15","2022-01-20","Согласовано с АЭС",null,null,null,null,null,null,"Хаднадь","Альмикеев","Альмикеев",null,null,null,null,null,null,null,"Базарев",null,null,"?????",null,null,null,null,null,"Кузьмин"]
[null,null,null,"F-Up",null,null,null,null,null,null,null,null,null,null,null,0]
[null,null,null,"F-Up",null,null,null,null,null,null,null,null,null,null,null,0]
[null,null,null,"F-Up",null,null,null,null,null,null,null,null,null,null,null,0]
[null,null,null,"F-Up",null,null,null,null,null,null,null,null,null,null,null,0]
[null,null,null,"F-Up",null,null,null,null,null,null,null,null,null,null,null,0]
[null,null,null,"F-Up",null,null,null,null,null,null,null,null,null,null,null,0]

{"sheet":"ГРАФИК ПП","index":1,"n_rows":31,"n_cols":382,"rows_kept":31,"cut":false,"hidden":false,"merged":[[2,290,2,320],[28,48,28,111],[2,321,2,350],[2,351,2,381],[2,17,2,47],[2,48,2,75],[2,76,2,106],[2,137,2,167],[2,168,2,197],[2,260,2,289],[29,48,29,111],[30,48,30,111],[2,198,2,228],[2,229,2,259],[1,5,1,6],[1,7,1,8],[1,9,1,10],[1,11,2,11]]}
[null,null,null,null,null,null,null,null,null,null,null,"ГРАФИК ПП ВАО АЭС-МЦ 2022"]
[null,null,null,null,null,"ДАТЫ ПРОВЕРКИ",null,"ДАТЫ ПРЕ-ВИЗИТА",null,"ДАТЫ CPO",null,"Период между ПП",null,null,null,null,null,"2022-01-01","2022-01-02","2022-01-03","2022-01-04","2022-01-05","2022-01-06","2022-01-07","2022-01-08","2022-01-09","2022-01-10","2022-01-11","2022-01-12","2022-01-13","2022-01-14","2022-01-15","2022-01-16","2022-01-17","2022-01-18","2022-01-19","2022-01-20","2022-01-21","2022-01-22","2022-01-23","2022-01-24","2022-01-25","2022-01-26","2022-01-27","2022-01-28","2022-01-29","2022-01-30","2022-01-31","2022-02-01","2022-02-02","2022-02-03","2022-02-04","2022-02-05","2022-02-06","2022-02-07","2022-02-08","2022-02-09","2022-02-10","2022-02-11","2022-02-12","2022-02-13","2022-02-14","2022-02-15","2022-02-16","2022-02-17","2022-02-18","2022-02-19","2022-02-20","2022-02-21","2022-02-22","2022-02-23","2022-02-24","2022-02-25","2022-02-26","2022-02-27","2022-02-28","2022-03-01","2022-03-02","2022-03-03","2022-03-04","2022-03-05","2022-03-06","2022-03-07","2022-03-08","2022-03-09","2022-03-10","2022-03-11","2022-03-12","2022-03-13","2022-03-14","2022-03-15","2022-03-16","2022-03-17","2022-03-18","2022-03-19","2022-03-20","2022-03-21","2022-03-22","2022-03-23","2022-03-24","2022-03-25","2022-03-26","2022-03-27","2022-03-28","2022-03-29","2022-03-30","2022-03-31","2022-04-01","2022-04-02","2022-04-03","2022-04-04","2022-04-05","2022-04-06","2022-04-07","2022-04-08","2022-04-09","2022-04-10","2022-04-11","2022-04-12","2022-04-13","2022-04-14","2022-04-15","2022-04-16","2022-04-17","2022-04-18","2022-04-19","2022-04-20","2022-04-21","2022-04-22","2022-04-23","2022-04-24","2022-04-25","2022-04-26","2022-04-27","2022-04-28","2022-04-29","2022-04-30","2022-05-01","2022-05-02","2022-05-03","2022-05-04","2022-05-05","2022-05-06","2022-05-07","2022-05-08","2022-05-09","2022-05-10","2022-05-11","2022-05-12","2022-05-13","2022-05-14","2022-05-15","2022-05-16","2022-05-17","2022-05-18","2022-05-19","2022-05-20","2022-05-21","2022-05-22","2022-05-23","2022-05-24","2022-05-25","2022-05-26","2022-05-27","2022-05-28","2022-05-29","2022-05-30","2022-05-31","2022-06-01","2022-06-02","2022-06-03","2022-06-04","2022-06-05","2022-06-06","2022-06-07","2022-06-08","2022-06-09","2022-06-10","2022-06-11","2022-06-12","2022-06-13","2022-06-14","2022-06-15","2022-06-16","2022-06-17","2022-06-18","2022-06-19","2022-06-20","2022-06-21","2022-06-22","2022-06-23","2022-06-24","2022-06-25","2022-06-26","2022-06-27","2022-06-28","2022-06-29","2022-06-30","2022-07-01","2022-07-02","2022-07-03","2022-07-04","2022-07-05","2022-07-06","2022-07-07","2022-07-08","2022-07-09","2022-07-10","2022-07-11","2022-07-12","2022-07-13","2022-07-14","2022-07-15","2022-07-16","2022-07-17","2022-07-18","2022-07-19","2022-07-20","2022-07-21","2022-07-22","2022-07-23","2022-07-24","2022-07-25","2022-07-26","2022-07-27","2022-07-28","2022-07-29","2022-07-30","2022-07-31","2022-08-01","2022-08-02","2022-08-03","2022-08-04","2022-08-05","2022-08-06","2022-08-07","2022-08-08","2022-08-09","2022-08-10","2022-08-11","2022-08-12","2022-08-13","2022-08-14","2022-08-15","2022-08-16","2022-08-17","2022-08-18","2022-08-19","2022-08-20","2022-08-21","2022-08-22","2022-08-23","2022-08-24","2022-08-25","2022-08-26","2022-08-27","2022-08-28","2022-08-29","2022-08-30","2022-08-31","2022-09-01","2022-09-02","2022-09-03","2022-09-04","2022-09-05","2022-09-06","2022-09-07","2022-09-08","2022-09-09","2022-09-10","2022-09-11","2022-09-12","2022-09-13","2022-09-14","2022-09-15","2022-09-16","2022-09-17","2022-09-18","2022-09-19","2022-09-20","2022-09-21","2022-09-22","2022-09-23","2022-09-24","2022-09-25","2022-09-26","2022-09-27","2022-09-28","2022-09-29","2022-09-30","2022-10-01","2022-10-02","2022-10-03","2022-10-04","2022-10-05","2022-10-06","2022-10-07","2022-10-08","2022-10-09","2022-10-10","2022-10-11","2022-10-12","2022-10-13","2022-10-14","2022-10-15","2022-10-16","2022-10-17","2022-10-18","2022-10-19","2022-10-20","2022-10-21","2022-10-22","2022-10-23","2022-10-24","2022-10-25","2022-10-26","2022-10-27","2022-10-28","2022-10-29","2022-10-30","2022-10-31","2022-11-01","2022-11-02","2022-11-03","2022-11-04","2022-11-05","2022-11-06","2022-11-07","2022-11-08","2022-11-09","2022-11-10","2022-11-11","2022-11-12","2022-11-13","2022-11-14","2022-11-15","2022-11-16","2022-11-17","2022-11-18","2022-11-19","2022-11-20","2022-11-21","2022-11-22","2022-11-23","2022-11-24","2022-11-25","2022-11-26","2022-11-27","2022-11-28","2022-11-29","2022-11-30","2022-12-01","2022-12-02","2022-12-03","2022-12-04","2022-12-05","2022-12-06","2022-12-07","2022-12-08","2022-12-09","2022-12-10","2022-12-11","2022-12-12","2022-12-13","2022-12-14","2022-12-15","2022-12-16","2022-12-17","2022-12-18","2022-12-19","2022-12-20","2022-12-21","2022-12-22","2022-12-23","2022-12-24","2022-12-25","2022-12-26","2022-12-27","2022-12-28","2022-12-29","2022-12-30","2022-12-31"]
[null,"АЭС","Страна","Тип ПП","Кат-ия","Начало","Окончание","Начало","Окончание","Начало","Окончание",null,"TL","Coord1","Coord2","CPO  TL","DIR","Январь",null,null,null,null,null,null,null,null,null,null,null,null,null,null,null,null,null,null,null,null,null,null,null,null,null,null,null,null,null,null,"Февраль",null,null,null,null,null,null,null,null,null,null,null,null,null,null,null,null,null,null,null,null,null,null,null,null,null,null,null,"Март",null,null,null,null,null,null,null,null,null,null,null,null,null,null,null,null,null,null,null,null,null,null,null,null,null,null,null,null,null,null,"Апрель",null,null,null,null,null,null,null,null,null,null,null,null,null,null,null,null,null,null,null,null,null,null,null,null,null,null,null,null,null,"Май",null,null,null,null,null,null,null,null,null,null,null,null,null,null,null,null,null,null,null,null,null,null,null,null,null,null,null,null,null,null,"Июнь",null,null,null,null,null,null,null,null,null,null,null,null,null,null,null,null,null,null,null,null,null,null,null,null,null,null,null,null,null,"Июль",null,null,null,null,null,null,null,null,null,null,null,null,null,null,null,null,null,null,null,null,null,null,null,null,null,null,null,null,null,null,"Август",null,null,null,null,null,null,null,null,null,null,null,null,null,null,null,null,null,null,null,null,null,null,null,null,null,null,null,null,null,null,"Сентябрь",null,null,null,null,null,null,null,null,null,null,null,null,null,null,null,null,null,null,null,null,null,null,null,null,null,null,null,null,null,"Октябрь",null,null,null,null,null,null,null,null,null,null,null,null,null,null,null,null,null,null,null,null,null,null,null,null,null,null,null,null,null,null,"Нобярь",null,null,null,null,null,null,null,null,null,null,null,null,null,null,null,null,null,null,null,null,null,null,null,null,null,null,null,null,null,"Декабрь"]
[null,"АЭС Богунице","Словакия","WPR5","B",{"$f":"VLOOKUP($B4,'КОМАНДЫ ПП'!$B$4:$S$28,4,0)","v":"2022-02-10"},{"$f":"VLOOKUP($B4,'КОМАНДЫ ПП'!$B$4:$S$28,5,0)","v":"2022-02-25"},{"$f":"VLOOKUP($B4,'КОМАНДЫ ПП'!$B$4:$S$28,7,0)","v":"2021-11-08"},{"$f":"VLOOKUP($B4,'КОМАНДЫ ПП'!$B$4:$S$28,8,0)","v":"2021-11-12"},{"$f":"VLOOKUP($B4,'КОМАНДЫ ПП'!$B$4:$S$28,10,0)","v":"cancelled"},{"$f":"VLOOKUP($B4,'КОМАНДЫ ПП'!$B$4:$S$28,11,0)","v":"cancelled"},{"$f":"VLOOKUP($B4,'ПЛАН ПП (2)'!$B$4:$AF$30,31,0)","v":"52 мес., 27 дн."},{"$f":"VLOOKUP($B4,'КОМАНДЫ ПП'!$B$4:$S$28,13,0)","v":"Хаднадь"},{"$f":"VLOOKUP($B4,'КОМАНДЫ ПП'!$B$4:$S$28,15,0)","v":"Аксёнов_С\nОтченашев"},{"$f":"VLOOKUP($B4,'КОМАНДЫ ПП'!$B$4:$S$28,16,0)","v":" "},{"$f":"VLOOKUP($B4,'КОМАНДЫ ПП'!$B$4:$S$28,17,0)","v":"cancelled"},{"$f":"VLOOKUP($B4,'КОМАНДЫ ПП'!$B$4:$S$28,18,0)","v":"Базарев"}," "]
[null,"АЭС Моховце","Словакия","WPR5","C",{"$f":"VLOOKUP($B5,'КОМАНДЫ ПП'!$B$4:$S$28,4,0)","v":"2022-03-10"},{"$f":"VLOOKUP($B5,'КОМАНДЫ ПП'!$B$4:$S$28,5,0)","v":"2022-03-25"},{"$f":"VLOOKUP($B5,'КОМАНДЫ ПП'!$B$4:$S$28,7,0)","v":"2021-09-27"},{"$f":"VLOOKUP($B5,'КОМАНДЫ ПП'!$B$4:$S$28,8,0)","v":"2021-10-01"},{"$f":"VLOOKUP($B5,'КОМАНДЫ ПП'!$B$4:$S$28,10,0)","v":"2022-03-06"},{"$f":"VLOOKUP($B5,'КОМАНДЫ ПП'!$B$4:$S$28,11,0)","v":"2022-03-16"},{"$f":"VLOOKUP($B5,'ПЛАН ПП (2)'!$B$4:$AF$30,31,0)","v":"47 мес., 23 дн."},{"$f":"VLOOKUP($B5,'КОМАНДЫ ПП'!$B$4:$S$28,13,0)","v":"Рыбчук"},{"$f":"VLOOKUP($B5,'КОМАНДЫ ПП'!$B$4:$S$28,15,0)","v":"Лачков\nБойковский"},{"$f":"VLOOKUP($B5,'КОМАНДЫ ПП'!$B$4:$S$28,16,0)","v":" "},{"$f":"VLOOKUP($B5,'КОМАНДЫ ПП'!$B$4:$S$28,17,0)","v":"Аксёнов_С\n"},{"$f":"VLOOKUP($B5,'КОМАНДЫ ПП'!$B$4:$S$28,18,0)","v":"Ширзади\nАльмикеев коуч"}," "]
[null,"ФГУП “Атомфлот”","Россия","WPR5","B",{"$f":"VLOOKUP($B6,'КОМАНДЫ ПП'!$B$4:$S$28,4,0)","v":"2022-09-29"},{"$f":"VLOOKUP($B6,'КОМАНДЫ ПП'!$B$4:$S$28,5,0)","v":"2022-10-14"},{"$f":"VLOOKUP($B6,'КОМАНДЫ ПП'!$B$4:$S$28,7,0)","v":"00:00:00"},{"$f":"VLOOKUP($B6,'КОМАНДЫ ПП'!$B$4:$S$28,8,0)","v":"00:00:00"},{"$f":"VLOOKUP($B6,'КОМАНДЫ ПП'!$B$4:$S$28,10,0)","v":"00:00:00"},{"$f":"VLOOKUP($B6,'КОМАНДЫ ПП'!$B$4:$S$28,11,0)","v":"00:00:00"},{"$f":"VLOOKUP($B6,'ПЛАН ПП (2)'!$B$4:$AF$30,31,0)","v":"46 мес., 2 дн."},{"$f":"VLOOKUP($B6,'КОМАНДЫ ПП'!$B$4:$S$28,13,0)","v":"Шаров"},{"$f":"VLOOKUP($B6,'КОМАНДЫ ПП'!$B$4:$S$28,15,0)","v":"Хромовских"},{"$f":"VLOOKUP($B6,'КОМАНДЫ ПП'!$B$4:$S$28,16,0)","v":" "},{"$f":"VLOOKUP($B6,'КОМАНДЫ ПП'!$B$4:$S$28,17,0)","v":"Базарев"},{"$f":"VLOOKUP($B6,'КОМАНДЫ ПП'!$B$4:$S$28,18,0)","v":"Хромовских"}," "]
[null,"ПАТЭС \"Академик Ломоносов\"","Россия","WPR5","B",{"$f":"VLOOKUP($B7,'КОМАНДЫ ПП'!$B$4:$S$28,4,0)","v":"2022-08-04"},{"$f":"VLOOKUP($B7,'КОМАНДЫ ПП'!$B$4:$S$28,5,0)","v":"2022-08-19"},{"$f":"VLOOKUP($B7,'КОМАНДЫ ПП'!$B$4:$S$28,7,0)","v":"2022-03-21"},{"$f":"VLOOKUP($B7,'КОМАНДЫ ПП'!$B$4:$S$28,8,0)","v":"2022-03-25"},{"$f":"VLOOKUP($B7,'КОМАНДЫ ПП'!$B$4:$S$28,10,0)","v":"00:00:00"},{"$f":"VLOOKUP($B7,'КОМАНДЫ ПП'!$B$4:$S$28,11,0)","v":"00:00:00"},{"$f":"VLOOKUP($B7,'ПЛАН ПП (2)'!$B$4:$AF$30,31,0)","v":{"$error":"#N/A"}},{"$f":"VLOOKUP($B7,'КОМАНДЫ ПП'!$B$4:$S$28,13,0)","v":"???\nГрунда"},{"$f":"VLOOKUP($B7,'КОМАНДЫ ПП'!$B$4:$S$28,15,0)","v":"Рыбаков"},{"$f":"VLOOKUP($B7,'КОМАНДЫ ПП'!$B$4:$S$28,16,0)","v":" "},{"$f":"VLOOKUP($B7,'КОМАНДЫ ПП'!$B$4:$S$28,17,0)","v":" Шаров"},{"$f":"VLOOKUP($B7,'КОМАНДЫ ПП'!$B$4:$S$28,18,0)","v":"Базарев"}," "]
[null,"Ленинградская АЭС","Россия","WPR5","B",{"$f":"VLOOKUP($B8,'КОМАНДЫ ПП'!$B$4:$S$28,4,0)","v":"2022-08-11"},{"$f":"VLOOKUP($B8,'КОМАНДЫ ПП'!$B$4:$S$28,5,0)","v":"2022-08-27"},{"$f":"VLOOKUP($B8,'КОМАНДЫ ПП'!$B$4:$S$28,7,0)","v":"2022-02-14"},{"$f":"VLOOKUP($B8,'КОМАНДЫ ПП'!$B$4:$S$28,8,0)","v":"2022-02-18"},{"$f":"VLOOKUP($B8,'КОМАНДЫ ПП'!$B$4:$S$28,10,0)","v":"2022-04-18"},{"$f":"VLOOKUP($B8,'КОМАНДЫ ПП'!$B$4:$S$28,11,0)","v":"2022-04-29"},{"$f":"VLOOKUP($B8,'ПЛАН ПП (2)'!$B$4:$AF$30,31,0)","v":"46 мес., 29 дн."},{"$f":"VLOOKUP($B8,'КОМАНДЫ ПП'!$B$4:$S$28,13,0)","v":"Дыроватый"},{"$f":"VLOOKUP($B8,'КОМАНДЫ ПП'!$B$4:$S$28,15,0)","v":"Альмикеев\nШирзади"},{"$f":"VLOOKUP($B8,'КОМАНДЫ ПП'!$B$4:$S$28,16,0)","v":" "},{"$f":"VLOOKUP($B8,'КОМАНДЫ ПП'!$B$4:$S$28,17,0)","v":"Рыбчук\nБазарев"},{"$f":"VLOOKUP($B8,'КОМАНДЫ ПП'!$B$4:$S$28,18,0)","v":"Альмикеев"}," "]
[null,"Армянская АЭС","Армения","WPR5","B",{"$f":"VLOOKUP($B9,'КОМАНДЫ ПП'!$B$4:$S$28,4,0)","v":"2022-08-25"},{"$f":"VLOOKUP($B9,'КОМАНДЫ ПП'!$B$4:$S$28,5,0)","v":"2022-09-10"},{"$f":"VLOOKUP($B9,'КОМАНДЫ ПП'!$B$4:$S$28,7,0)","v":"2022-04-25"},{"$f":"VLOOKUP($B9,'КОМАНДЫ ПП'!$B$4:$S$28,8,0)","v":"2022-04-29"},{"$f":"VLOOKUP($B9,'КОМАНДЫ ПП'!$B$4:$S$28,10,0)","v":"00:00:00"},{"$f":"VLOOKUP($B9,'КОМАНДЫ ПП'!$B$4:$S$28,11,0)","v":"00:00:00"},{"$f":"VLOOKUP($B9,'ПЛАН ПП (2)'!$B$4:$AF$30,31,0)","v":"60 мес., 1 дн."},{"$f":"VLOOKUP($B9,'КОМАНДЫ ПП'!$B$4:$S$28,13,0)","v":"Бойковский"},{"$f":"VLOOKUP($B9,'КОМАНДЫ ПП'!$B$4:$S$28,15,0)","v":"Лачков\nКенджецян"},{"$f":"VLOOKUP($B9,'КОМАНДЫ ПП'!$B$4:$S$28,16,0)","v":" "},{"$f":"VLOOKUP($B9,'КОМАНДЫ ПП'!$B$4:$S$28,17,0)","v":"Васильчук"},{"$f":"VLOOKUP($B9,'КОМАНДЫ ПП'!$B$4:$S$28,18,0)","v":"Альмикеев"}," "]
[null,"Калининская АЭС","Россия","WPR5","B",{"$f":"VLOOKUP($B10,'КОМАНДЫ ПП'!$B$4:$S$28,4,0)","v":"2022-10-06"},{"$f":"VLOOKUP($B10,'КОМАНДЫ ПП'!$B$4:$S$28,5,0)","v":"2022-10-21"},{"$f":"VLOOKUP($B10,'КОМАНДЫ ПП'!$B$4:$S$28,7,0)","v":"2022-04-25"},{"$f":"VLOOKUP($B10,'КОМАНДЫ ПП'!$B$4:$S$28,8,0)","v":"2022-04-29"},{"$f":"VLOOKUP($B10,'КОМАНДЫ ПП'!$B$4:$S$28,10,0)","v":"2022-10-03"},{"$f":"VLOOKUP($B10,'КОМАНДЫ ПП'!$B$4:$S$28,11,0)","v":"2022-10-14"},{"$f":"VLOOKUP($B10,'ПЛАН ПП (2)'!$B$4:$AF$30,31,0)","v":"49 мес., 6 дн."},{"$f":"VLOOKUP($B10,'КОМАНДЫ ПП'!$B$4:$S$28,13,0)","v":"Креницкий?"},{"$f":"VLOOKUP($B10,'КОМАНДЫ ПП'!$B$4:$S$28,15,0)","v":"Хромовских\nЩелик"},{"$f":"VLOOKUP($B10,'КОМАНДЫ ПП'!$B$4:$S$28,16,0)","v":" "},{"$f":"VLOOKUP($B10,'КОМАНДЫ ПП'!$B$4:$S$28,17,0)","v":"Шаров"},{"$f":"VLOOKUP($B10,'КОМАНДЫ ПП'!$B$4:$S$28,18,0)","v":"Хромовских"}," "]
[null,"Ростовская АЭС","Россия","WPR5","A",{"$f":"VLOOKUP($B11,'КОМАНДЫ ПП'!$B$4:$S$28,4,0)","v":"2022-11-10"},{"$f":"VLOOKUP($B11,'КОМАНДЫ ПП'!$B$4:$S$28,5,0)","v":"2022-11-25"},{"$f":"VLOOKUP($B11,'КОМАНДЫ ПП'!$B$4:$S$28,7,0)","v":"2022-07-18"},{"$f":"VLOOKUP($B11,'КОМАНДЫ ПП'!$B$4:$S$28,8,0)","v":"2022-07-22"},{"$f":"VLOOKUP($B11,'КОМАНДЫ ПП'!$B$4:$S$28,10,0)","v":"00:00:00"},{"$f":"VLOOKUP($B11,'КОМАНДЫ ПП'!$B$4:$S$28,11,0)","v":"00:00:00"},{"$f":"VLOOKUP($B11,'ПЛАН ПП (2)'!$B$4:$AF$30,31,0)","v":"47 мес., 12 дн."},{"$f":"VLOOKUP($B11,'КОМАНДЫ ПП'!$B$4:$S$28,13,0)","v":"Бойковский\nГрунда?"},{"$f":"VLOOKUP($B11,'КОМАНДЫ ПП'!$B$4:$S$28,15,0)","v":"Отченашев\nКопылов\n"},{"$f":"VLOOKUP($B11,'КОМАНДЫ ПП'!$B$4:$S$28,16,0)","v":" "},{"$f":"VLOOKUP($B11,'КОМАНДЫ ПП'!$B$4:$S$28,17,0)","v":"Дыроватый"},{"$f":"VLOOKUP($B11,'КОМАНДЫ ПП'!$B$4:$S$28,18,0)","v":"Базарев"}," "]
[null,null,null,null,null,{"$f":"VLOOKUP($B12,'КОМАНДЫ ПП'!$B$4:$S$28,4,0)","v":{"$error":"#N/A"}},{"$f":"VLOOKUP($B12,'КОМАНДЫ ПП'!$B$4:$S$28,5,0)","v":{"$error":"#N/A"}},{"$f":"VLOOKUP($B12,'КОМАНДЫ ПП'!$B$4:$S$28,7,0)","v":{"$error":"#N/A"}},{"$f":"VLOOKUP($B12,'КОМАНДЫ ПП'!$B$4:$S$28,8,0)","v":{"$error":"#N/A"}},{"$f":"VLOOKUP($B12,'КОМАНДЫ ПП'!$B$4:$S$28,10,0)","v":{"$error":"#N/A"}},{"$f":"VLOOKUP($B12,'КОМАНДЫ ПП'!$B$4:$S$28,11,0)","v":{"$error":"#N/A"}},{"$f":"VLOOKUP($B12,'ПЛАН ПП (2)'!$B$4:$AF$30,31,0)","v":{"$error":"#N/A"}},{"$f":"VLOOKUP($B12,'КОМАНДЫ ПП'!$B$4:$S$28,13,0)","v":{"$error":"#N/A"}},{"$f":"VLOOKUP($B12,'КОМАНДЫ ПП'!$B$4:$S$28,15,0)","v":{"$error":"#N/A"}},{"$f":"VLOOKUP($B12,'КОМАНДЫ ПП'!$B$4:$S$28,16,0)","v":{"$error":"#N/A"}},{"$f":"VLOOKUP($B12,'КОМАНДЫ ПП'!$B$4:$S$28,17,0)","v":{"$error":"#N/A"}},{"$f":"VLOOKUP($B12,'КОМАНДЫ ПП'!$B$4:$S$28,18,0)","v":{"$error":"#N/A"}}," "]
[null,null,null,null,null,{"$f":"VLOOKUP($B13,'КОМАНДЫ ПП'!$B$4:$S$28,4,0)","v":{"$error":"#N/A"}},{"$f":"VLOOKUP($B13,'КОМАНДЫ ПП'!$B$4:$S$28,5,0)","v":{"$error":"#N/A"}},{"$f":"VLOOKUP($B13,'КОМАНДЫ ПП'!$B$4:$S$28,7,0)","v":{"$error":"#N/A"}},{"$f":"VLOOKUP($B13,'КОМАНДЫ ПП'!$B$4:$S$28,8,0)","v":{"$error":"#N/A"}},{"$f":"VLOOKUP($B13,'КОМАНДЫ ПП'!$B$4:$S$28,10,0)","v":{"$error":"#N/A"}},{"$f":"VLOOKUP($B13,'КОМАНДЫ ПП'!$B$4:$S$28,11,0)","v":{"$error":"#N/A"}},{"$f":"VLOOKUP($B13,'ПЛАН ПП (2)'!$B$4:$AF$30,31,0)","v":{"$error":"#N/A"}},{"$f":"VLOOKUP($B13,'КОМАНДЫ ПП'!$B$4:$S$28,13,0)","v":{"$error":"#N/A"}},{"$f":"VLOOKUP($B13,'КОМАНДЫ ПП'!$B$4:$S$28,15,0)","v":{"$error":"#N/A"}},{"$f":"VLOOKUP($B13,'КОМАНДЫ ПП'!$B$4:$S$28,16,0)","v":{"$error":"#N/A"}},{"$f":"VLOOKUP($B13,'КОМАНДЫ ПП'!$B$4:$S$28,17,0)","v":{"$error":"#N/A"}},{"$f":"VLOOKUP($B13,'КОМАНДЫ ПП'!$B$4:$S$28,18,0)","v":{"$error":"#N/A"}}," "]
[null,null,null,null,null,{"$f":"VLOOKUP($B14,'КОМАНДЫ ПП'!$B$4:$S$28,4,0)","v":{"$error":"#N/A"}},{"$f":"VLOOKUP($B14,'КОМАНДЫ ПП'!$B$4:$S$28,5,0)","v":{"$error":"#N/A"}},{"$f":"VLOOKUP($B14,'КОМАНДЫ ПП'!$B$4:$S$28,7,0)","v":{"$error":"#N/A"}},{"$f":"VLOOKUP($B14,'КОМАНДЫ ПП'!$B$4:$S$28,8,0)","v":{"$error":"#N/A"}},{"$f":"VLOOKUP($B14,'КОМАНДЫ ПП'!$B$4:$S$28,10,0)","v":{"$error":"#N/A"}},{"$f":"VLOOKUP($B14,'КОМАНДЫ ПП'!$B$4:$S$28,11,0)","v":{"$error":"#N/A"}},{"$f":"VLOOKUP($B14,'ПЛАН ПП (2)'!$B$4:$AF$30,31,0)","v":{"$error":"#N/A"}},{"$f":"VLOOKUP($B14,'КОМАНДЫ ПП'!$B$4:$S$28,13,0)","v":{"$error":"#N/A"}},{"$f":"VLOOKUP($B14,'КОМАНДЫ ПП'!$B$4:$S$28,15,0)","v":{"$error":"#N/A"}},{"$f":"VLOOKUP($B14,'КОМАНДЫ ПП'!$B$4:$S$28,16,0)","v":{"$error":"#N/A"}},{"$f":"VLOOKUP($B14,'КОМАНДЫ ПП'!$B$4:$S$28,17,0)","v":{"$error":"#N/A"}},{"$f":"VLOOKUP($B14,'КОМАНДЫ ПП'!$B$4:$S$28,18,0)","v":{"$error":"#N/A"}}," "]
[null,null,null,null,null,{"$f":"VLOOKUP($B15,'КОМАНДЫ ПП'!$B$4:$S$28,4,0)","v":{"$error":"#N/A"}},{"$f":"VLOOKUP($B15,'КОМАНДЫ ПП'!$B$4:$S$28,5,0)","v":{"$error":"#N/A"}},{"$f":"VLOOKUP($B15,'КОМАНДЫ ПП'!$B$4:$S$28,7,0)","v":{"$error":"#N/A"}},{"$f":"VLOOKUP($B15,'КОМАНДЫ ПП'!$B$4:$S$28,8,0)","v":{"$error":"#N/A"}},{"$f":"VLOOKUP($B15,'КОМАНДЫ ПП'!$B$4:$S$28,10,0)","v":{"$error":"#N/A"}},{"$f":"VLOOKUP($B15,'КОМАНДЫ ПП'!$B$4:$S$28,11,0)","v":{"$error":"#N/A"}},{"$f":"VLOOKUP($B15,'ПЛАН ПП (2)'!$B$4:$AF$30,31,0)","v":{"$error":"#N/A"}},{"$f":"VLOOKUP($B15,'КОМАНДЫ ПП'!$B$4:$S$28,13,0)","v":{"$error":"#N/A"}},{"$f":"VLOOKUP($B15,'КОМАНДЫ ПП'!$B$4:$S$28,15,0)","v":{"$error":"#N/A"}},{"$f":"VLOOKUP($B15,'КОМАНДЫ ПП'!$B$4:$S$28,16,0)","v":{"$error":"#N/A"}},{"$f":"VLOOKUP($B15,'КОМАНДЫ ПП'!$B$4:$S$28,17,0)","v":{"$error":"#N/A"}},{"$f":"VLOOKUP($B15,'КОМАНДЫ ПП'!$B$4:$S$28,18,0)","v":{"$error":"#N/A"}}," "]
[null,"Моховце-4","Словакия","PSUR",null,{"$f":"VLOOKUP($B16,'КОМАНДЫ ПП'!$B$4:$S$28,4,0)","v":"01.12.2022?"},{"$f":"VLOOKUP($B16,'КОМАНДЫ ПП'!$B$4:$S$28,5,0)","v":"2022-12-28"},{"$f":"VLOOKUP($B16,'КОМАНДЫ ПП'!$B$4:$S$28,7,0)","v":"00:00:00"},{"$f":"VLOOKUP($B16,'КОМАНДЫ ПП'!$B$4:$S$28,8,0)","v":"00:00:00"},{"$f":"VLOOKUP($B16,'КОМАНДЫ ПП'!$B$4:$S$28,10,0)","v":"00:00:00"},{"$f":"VLOOKUP($B16,'КОМАНДЫ ПП'!$B$4:$S$28,11,0)","v":"00:00:00"},null,{"$f":"VLOOKUP($B16,'КОМАНДЫ ПП'!$B$4:$S$28,13,0)","v":"Баджио"},{"$f":"VLOOKUP($B16,'КОМАНДЫ ПП'!$B$4:$S$28,15,0)","v":"Альмикеев"},null,null,null," "]
[null,"Атомфлот, УАЛ \"Урал\"","Россия","PSUR",null,{"$f":"VLOOKUP($B17,'КОМАНДЫ ПП'!$B$4:$S$28,4,0)","v":"01.12.2022?"},{"$f":"VLOOKUP($B17,'КОМАНДЫ ПП'!$B$4:$S$28,5,0)","v":"2022-12-28"},{"$f":"VLOOKUP($B17,'КОМАНДЫ ПП'!$B$4:$S$28,7,0)","v":"00:00:00"},{"$f":"VLOOKUP($B17,'КОМАНДЫ ПП'!$B$4:$S$28,8,0)","v":"00:00:00"},{"$f":"VLOOKUP($B17,'КОМАНДЫ ПП'!$B$4:$S$28,10,0)","v":"00:00:00"},{"$f":"VLOOKUP($B17,'КОМАНДЫ ПП'!$B$4:$S$28,11,0)","v":"00:00:00"},null,{"$f":"VLOOKUP($B17,'КОМАНДЫ ПП'!$B$4:$S$28,13,0)","v":"Рыбчук"},{"$f":"VLOOKUP($B17,'КОМАНДЫ ПП'!$B$4:$S$28,15,0)","v":0},null,null,null," "]
[null,null,null,null,null,{"$f":"VLOOKUP($B18,'КОМАНДЫ ПП'!$B$4:$S$28,4,0)","v":{"$error":"#N/A"}},{"$f":"VLOOKUP($B18,'КОМАНДЫ ПП'!$B$4:$S$28,5,0)","v":{"$error":"#N/A"}},{"$f":"VLOOKUP($B18,'КОМАНДЫ ПП'!$B$4:$S$28,7,0)","v":{"$error":"#N/A"}},{"$f":"VLOOKUP($B18,'КОМАНДЫ ПП'!$B$4:$S$28,8,0)","v":{"$error":"#N/A"}},{"$f":"VLOOKUP($B18,'КОМАНДЫ ПП'!$B$4:$S$28,10,0)","v":{"$error":"#N/A"}},{"$f":"VLOOKUP($B18,'КОМАНДЫ ПП'!$B$4:$S$28,11,0)","v":{"$error":"#N/A"}},null,{"$f":"VLOOKUP($B18,'КОМАНДЫ ПП'!$B$4:$S$28,13,0)","v":{"$error":"#N/A"}},{"$f":"VLOOKUP($B18,'КОМАНДЫ ПП'!$B$4:$S$28,15,0)","v":{"$error":"#N/A"}},null,null,null," "]
[null,null,null,null,null,{"$f":"VLOOKUP($B19,'КОМАНДЫ ПП'!$B$4:$S$28,4,0)","v":{"$error":"#N/A"}},{"$f":"VLOOKUP($B19,'КОМАНДЫ ПП'!$B$4:$S$28,5,0)","v":{"$error":"#N/A"}},{"$f":"VLOOKUP($B19,'КОМАНДЫ ПП'!$B$4:$S$28,7,0)","v":{"$error":"#N/A"}},{"$f":"VLOOKUP($B19,'КОМАНДЫ ПП'!$B$4:$S$28,8,0)","v":{"$error":"#N/A"}},{"$f":"VLOOKUP($B19,'КОМАНДЫ ПП'!$B$4:$S$28,10,0)","v":{"$error":"#N/A"}},{"$f":"VLOOKUP($B19,'КОМАНДЫ ПП'!$B$4:$S$28,11,0)","v":{"$error":"#N/A"}},null,{"$f":"VLOOKUP($B19,'КОМАНДЫ ПП'!$B$4:$S$28,13,0)","v":{"$error":"#N/A"}},{"$f":"VLOOKUP($B19,'КОМАНДЫ ПП'!$B$4:$S$28,15,0)","v":{"$error":"#N/A"}},null,null,null," "]
[null,"Куданкулам ",null,null,null,{"$f":"VLOOKUP($B20,'КОМАНДЫ ПП'!$B$4:$S$28,4,0)","v":"2022-02-07"},{"$f":"VLOOKUP($B20,'КОМАНДЫ ПП'!$B$4:$S$28,5,0)","v":"2022-02-11"}," ",null,null,null,null,{"$f":"VLOOKUP($B20,'КОМАНДЫ ПП'!$B$4:$S$28,13,0)","v":0},{"$f":"VLOOKUP($B20,'КОМАНДЫ ПП'!$B$4:$S$28,15,0)","v":"Лачков"},null,null,null," "]
[null,"Бушер",null,null,null,{"$f":"VLOOKUP($B21,'КОМАНДЫ ПП'!$B$4:$S$28,4,0)","v":"2022-01-15"},{"$f":"VLOOKUP($B21,'КОМАНДЫ ПП'!$B$4:$S$28,5,0)","v":"2022-01-20"}," ",null,null,null,null,{"$f":"VLOOKUP($B21,'КОМАНДЫ ПП'!$B$4:$S$28,13,0)","v":"Хаднадь"},{"$f":"VLOOKUP($B21,'КОМАНДЫ ПП'!$B$4:$S$28,15,0)","v":"Альмикеев"},null,null,null," "]
[null,null,null,null,null,{"$f":"VLOOKUP($B22,'КОМАНДЫ ПП'!$B$4:$S$28,4,0)","v":{"$error":"#N/A"}},{"$f":"VLOOKUP($B22,'КОМАНДЫ ПП'!$B$4:$S$28,5,0)","v":{"$error":"#N/A"}}," ",null,null,null,null,{"$f":"VLOOKUP($B22,'КОМАНДЫ ПП'!$B$4:$S$28,13,0)","v":{"$error":"#N/A"}},{"$f":"VLOOKUP($B22,'КОМАНДЫ ПП'!$B$4:$S$28,15,0)","v":{"$error":"#N/A"}},null,null,null," "]
[null,null,null,null,null,{"$f":"VLOOKUP($B23,'КОМАНДЫ ПП'!$B$4:$S$28,4,0)","v":{"$error":"#N/A"}},{"$f":"VLOOKUP($B23,'КОМАНДЫ ПП'!$B$4:$S$28,5,0)","v":{"$error":"#N/A"}}," ",null,null,null,null,{"$f":"VLOOKUP($B23,'КОМАНДЫ ПП'!$B$4:$S$28,13,0)","v":{"$error":"#N/A"}},{"$f":"VLOOKUP($B23,'КОМАНДЫ ПП'!$B$4:$S$28,15,0)","v":{"$error":"#N/A"}},null,null,null," "]
[null,null,null,null,null,{"$f":"VLOOKUP($B24,'КОМАНДЫ ПП'!$B$4:$S$28,4,0)","v":{"$error":"#N/A"}},{"$f":"VLOOKUP($B24,'КОМАНДЫ ПП'!$B$4:$S$28,5,0)","v":{"$error":"#N/A"}}," ",null,null,null,null,{"$f":"VLOOKUP($B24,'КОМАНДЫ ПП'!$B$4:$S$28,13,0)","v":{"$error":"#N/A"}},{"$f":"VLOOKUP($B24,'КОМАНДЫ ПП'!$B$4:$S$28,15,0)","v":{"$error":"#N/A"}},null,null,null," "]
[null,null,null,null,null,{"$f":"VLOOKUP($B25,'КОМАНДЫ ПП'!$B$4:$S$28,4,0)","v":{"$error":"#N/A"}},{"$f":"VLOOKUP($B25,'КОМАНДЫ ПП'!$B$4:$S$28,5,0)","v":{"$error":"#N/A"}}," ",null,null,null,null,{"$f":"VLOOKUP($B25,'КОМАНДЫ ПП'!$B$4:$S$28,13,0)","v":{"$error":"#N/A"}},{"$f":"VLOOKUP($B25,'КОМАНДЫ ПП'!$B$4:$S$28,15,0)","v":{"$error":"#N/A"}},null,null,null," "]
[null,null,null,null,null,{"$f":"VLOOKUP($B26,'КОМАНДЫ ПП'!$B$4:$S$28,4,0)","v":{"$error":"#N/A"}},{"$f":"VLOOKUP($B26,'КОМАНДЫ ПП'!$B$4:$S$28,5,0)","v":{"$error":"#N/A"}}," ",null,null,null,null,{"$f":"VLOOKUP($B26,'КОМАНДЫ ПП'!$B$4:$S$28,13,0)","v":{"$error":"#N/A"}},{"$f":"VLOOKUP($B26,'КОМАНДЫ ПП'!$B$4:$S$28,15,0)","v":{"$error":"#N/A"}},null,null,null," "]
[null,null,null,null,null,{"$f":"VLOOKUP($B27,'КОМАНДЫ ПП'!$B$4:$S$28,4,0)","v":{"$error":"#N/A"}},{"$f":"VLOOKUP($B27,'КОМАНДЫ ПП'!$B$4:$S$28,5,0)","v":{"$error":"#N/A"}}," ",null,null,null,null,{"$f":"VLOOKUP($B27,'КОМАНДЫ ПП'!$B$4:$S$28,13,0)","v":{"$error":"#N/A"}},{"$f":"VLOOKUP($B27,'КОМАНДЫ ПП'!$B$4:$S$28,15,0)","v":{"$error":"#N/A"}},null,null,null," "]
[]
[null,null,null,null,null,null,null,null,null,null,null,null,null,null,null,null,null,null,null,null,null,null,null,null,null,null,null,null,null,null,null,null,null,null,null,null,null,null,null,null,null,null,null,null,null,null,null,null,"ПП АЭС категории А",null,null,null,null,null,null,null,null,null,null,null,null,null,null,null,null,null,null,null,null,null,null,null,null,null,null,null,null,null,null,null,null,null,null,null,null,null,null,null,null,null,null,null,null,null,null,null,null,null,null,null,null,null,null,null,null,null,null,null,null,null,null,null,null,null,null,null,null,null,null,null,null,null,null,null,null,null,null,null,null,null,null,null,null,null,null,null,null,null,null,null,null,null,null,null,null,null,null,null,null,null,null,null,"CPO"]
[null,null,null,null,null,null,null,null,null,null,null,null,null,null,null,null,null,null,null,null,null,null,null,null,null,null,null,null,null,null,null,null,null,null,null,null,null,null,null,null,null,null,null,null,null,null,null,null,"ПП АЭС категории B",null,null,null,null,null,null,null,null,null,null,null,null,null,null,null,null,null,null,null,null,null,null,null,null,null,null,null,null,null,null,null,null,null,null,null,null,null,null,null,null,null,null,null,null,null,null,null,null,null,null,null,null,null,null,null,null,null,null,null,null,null,null,null,null,null,null,null,null,null,null,null,null,null,null,null,null,null,null,null,null,null,null,null,null,null,null,null,null,null,null,null,null,null,null,null,null,null,null,null,null,null,null,null,"ПРЕ-ВИЗИТ"]
[null,null,null,null,null,null,null,null,null,null,null,null,null,null,null,null,null,null,null,null,null,null,null,null,null,null,null,null,null,null,null,null,null,null,null,null,null,null,null,null,null,null,null,null,null,null,null,null,"ПП АЭС категории C",null,null,null,null,null,null,null,null,null,null,null,null,null,null,null,null,null,null,null,null,null,null,null,null,null,null,null,null,null,null,null,null,null,null,null,null,null,null,null,null,null,null,null,null,null,null,null,null,null,null,null,null,null,null,null,null,null,null,null,null,null,null,null,null,null,null,null,null,null,null,null,null,null,null,null,null,null,null,null,null,null,null,null,null,null,null,null,null,null,null,null,null,null,null,null,null,null,null,null,null,null,null,null,"PSUR и F-Up"]

{"sheet":"КОМАНДЫ ПП РАСЧ","index":2,"n_rows":28,"n_cols":29,"rows_kept":28,"cut":false,"hidden":true,"merged":[[1,5,1,6],[1,7,1,8],[1,9,1,10]]}
[null,{"$f":"'КОМАНДЫ ПП'!L1","v":2022}]
[null,null,null,null,null,"ДАТЫ ПРОВЕРКИ",null,"ДАТЫ ПРЕ-ВИЗИТА",null,"ДАТЫ CPO"]
[null,"АЭС","Страна","Тип ПП","НМ","Начало","Окончание","Начало","Окончание","Начало","Окончание","TL","Coord","CPO TL","DIR","ExitRep","IndAdv","CPO","OA","OP","MA","EN","RP","OE","SOER","CY","TR","FP","EP"]
[null,"АЭС Пакш","Венгрия","WPR5",{"$f":"CONCATENATE(B4,\", \",D4,\", TL: \",L4,\", CC: \",M4,\", \",#REF!)","v":{"$error":"#REF!"}},{"$f":"IF('ГРАФИК ПП'!F4>0,'ГРАФИК ПП'!F4,\" \")","v":"2022-02-10"},{"$f":"IF('ГРАФИК ПП'!G4>0,'ГРАФИК ПП'!G4,\" \")","v":"2022-02-25"},{"$f":"IF('ГРАФИК ПП'!H4>0,'ГРАФИК ПП'!H4,\" \")","v":"2021-11-08"},{"$f":"IF('ГРАФИК ПП'!I4>0,'ГРАФИК ПП'!I4,\" \")","v":"2021-11-12"},{"$f":"IF('ГРАФИК ПП'!$J4=\"TBD\",$F4,IF('ГРАФИК ПП'!$J4>0,'ГРАФИК ПП'!$J4,\" \"))","v":"cancelled"},{"$f":"IF('ГРАФИК ПП'!K4>0,'ГРАФИК ПП'!K4,\" \")","v":"cancelled"},{"$f":"IF(YEAR($F4)=$B$1,'ГРАФИК ПП'!$M4,0)","v":"Хаднадь"},{"$f":"IF(YEAR($F4)=$B$1,CONCATENATE('ГРАФИК ПП'!N4,\", \",'ГРАФИК ПП'!O4),0)","v":"Аксёнов_С\nОтченашев,  "},{"$f":"IF(YEAR($J4)=$B$1,'КОМАНДЫ ПП'!$R4,0)","v":{"$error":"#VALUE!"}},{"$f":"'ГРАФИК ПП'!Q4","v":"Базарев"},{"$f":"'КОМАНДЫ ПП'!T4","v":"  ?"},{"$f":"'КОМАНДЫ ПП'!U4","v":"?"},{"$f":"IF(YEAR($J4)=$B$1,'КОМАНДЫ ПП'!$V4,0)","v":{"$error":"#VALUE!"}},{"$f":"'КОМАНДЫ ПП'!W4","v":"Luke Sanna (AC)\nSergey Boyko"},{"$f":"'КОМАНДЫ ПП'!X4","v":"Alexandr Rybchuk\nKároly Vigh"},{"$f":"'КОМАНДЫ ПП'!Y4","v":"Aleš Mlejnek\nMaxim Milyaev"},{"$f":"'КОМАНДЫ ПП'!Z4","v":"Ingrid Brejchova\nPavel Kondratyev\nZsolt Herger"},{"$f":"'КОМАНДЫ ПП'!AA4","v":"Dmitry Vinnikov"},{"$f":"'КОМАНДЫ ПП'!AB4","v":"Dmitry Bazarev\nPC"},{"$f":"'КОМАНДЫ ПП'!AC4","v":"Evgeny Kirilenko "},{"$f":"'КОМАНДЫ ПП'!AD4","v":"Minna Mäkinen"},{"$f":"'КОМАНДЫ ПП'!AE4","v":"Mihail Sharov "},{"$f":"'КОМАНДЫ ПП'!AF4","v":"Nikolay Angelov"},{"$f":"'КОМАНДЫ ПП'!AG4","v":"László Kovacsóczy\nVyacheslav Blyednykh"}]
[null,"Белоярская АЭС","Россия","WPR5",{"$f":"CONCATENATE(B5,\", \",D5,\", TL: \",L5,\", CC: \",M5,\", \",#REF!)","v":{"$error":"#REF!"}},{"$f":"IF('ГРАФИК ПП'!F5>0,'ГРАФИК ПП'!F5,\" \")","v":"2022-03-10"},{"$f":"IF('ГРАФИК ПП'!G5>0,'ГРАФИК ПП'!G5,\" \")","v":"2022-03-25"},{"$f":"IF('ГРАФИК ПП'!H5>0,'ГРАФИК ПП'!H5,\" \")","v":"2021-09-27"},{"$f":"IF('ГРАФИК ПП'!I5>0,'ГРАФИК ПП'!I5,\" \")","v":"2021-10-01"},{"$f":"IF('ГРАФИК ПП'!$J5=\"TBD\",$F5,IF('ГРАФИК ПП'!$J5>0,'ГРАФИК ПП'!$J5,\" \"))","v":"2022-03-06"},{"$f":"IF('ГРАФИК ПП'!K5>0,'ГРАФИК ПП'!K5,\" \")","v":"2022-03-16"},{"$f":"IF(YEAR($F5)=$B$1,'ГРАФИК ПП'!$M5,0)","v":"Рыбчук"},{"$f":"IF(YEAR($F5)=$B$1,CONCATENATE('ГРАФИК ПП'!N5,\", \",'ГРАФИК ПП'!O5),0)","v":"Лачков\nБойковский,  "},{"$f":"IF(YEAR($J5)=$B$1,'КОМАНДЫ ПП'!$R5,0)","v":"Аксёнов_С\n"},{"$f":"'ГРАФИК ПП'!Q5","v":"Ширзади\nАльмикеев коуч"},{"$f":"'КОМАНДЫ ПП'!T5","v":0},{"$f":"'КОМАНДЫ ПП'!U5","v":0},{"$f":"IF(YEAR($J5)=$B$1,'КОМАНДЫ ПП'!$V5,0)","v":0},{"$f":"'КОМАНДЫ ПП'!W5","v":"AC"},{"$f":"'КОМАНДЫ ПП'!X5","v":"Турилов"},{"$f":"'КОМАНДЫ ПП'!Y5","v":0},{"$f":"'КОМАНДЫ ПП'!Z5","v":"PC"},{"$f":"'КОМАНДЫ ПП'!AA5","v":0},{"$f":"'КОМАНДЫ ПП'!AB5","v":0},{"$f":"'КОМАНДЫ ПП'!AC5","v":0},{"$f":"'КОМАНДЫ ПП'!AD5","v":0},{"$f":"'КОМАНДЫ ПП'!AE5","v":0},{"$f":"'КОМАНДЫ ПП'!AF5","v":0},{"$f":"'КОМАНДЫ ПП'!AG5","v":"TC"}]
[null,"АЭС Дукованы","Чехия ","WPR5",{"$f":"CONCATENATE(B6,\", \",D6,\", TL: \",L6,\", CC: \",M6,\", \",#REF!)","v":{"$error":"#REF!"}},{"$f":"IF('ГРАФИК ПП'!F6>0,'ГРАФИК ПП'!F6,\" \")","v":"2022-09-29"},{"$f":"IF('ГРАФИК ПП'!G6>0,'ГРАФИК ПП'!G6,\" \")","v":"2022-10-14"},{"$f":"IF('ГРАФИК ПП'!H6>0,'ГРАФИК ПП'!H6,\" \")","v":" "},{"$f":"IF('ГРАФИК ПП'!I6>0,'ГРАФИК ПП'!I6,\" \")","v":" "},{"$f":"IF('ГРАФИК ПП'!$J6=\"TBD\",$F6,IF('ГРАФИК ПП'!$J6>0,'ГРАФИК ПП'!$J6,\" \"))","v":" "},{"$f":"IF('ГРАФИК ПП'!K6>0,'ГРАФИК ПП'!K6,\" \")","v":" "},{"$f":"IF(YEAR($F6)=$B$1,'ГРАФИК ПП'!$M6,0)","v":"Шаров"},{"$f":"IF(YEAR($F6)=$B$1,CONCATENATE('ГРАФИК ПП'!N6,\", \",'ГРАФИК ПП'!O6),0)","v":"Хромовских,  "},{"$f":"IF(YEAR($J6)=$B$1,'КОМАНДЫ ПП'!$R7,0)","v":{"$error":"#VALUE!"}},{"$f":"'ГРАФИК ПП'!Q6","v":"Хромовских"},{"$f":"'КОМАНДЫ ПП'!T7","v":0},{"$f":"'КОМАНДЫ ПП'!U7","v":0},{"$f":"IF(YEAR($J6)=$B$1,'КОМАНДЫ ПП'!$V7,0)","v":{"$error":"#VALUE!"}},{"$f":"'КОМАНДЫ ПП'!W7","v":0},{"$f":"'КОМАНДЫ ПП'!X7","v":0},{"$f":"'КОМАНДЫ ПП'!Y7","v":0},{"$f":"'КОМАНДЫ ПП'!Z7","v":0},{"$f":"'КОМАНДЫ ПП'!AA7","v":0},{"$f":"'КОМАНДЫ ПП'!AB7","v":0},{"$f":"'КОМАНДЫ ПП'!AC7","v":0},{"$f":"'КОМАНДЫ ПП'!AD7","v":0},{"$f":"'КОМАНДЫ ПП'!AE7","v":0},{"$f":"'КОМАНДЫ ПП'!AF7","v":0},{"$f":"'КОМАНДЫ ПП'!AG7","v":0}]
[null,"Запорожская АЭС","Украина","WPR5",{"$f":"CONCATENATE(B7,\", \",D7,\", TL: \",L7,\", CC: \",M7,\", \",#REF!)","v":{"$error":"#REF!"}},{"$f":"IF('ГРАФИК ПП'!F7>0,'ГРАФИК ПП'!F7,\" \")","v":"2022-08-04"},{"$f":"IF('ГРАФИК ПП'!G7>0,'ГРАФИК ПП'!G7,\" \")","v":"2022-08-19"},{"$f":"IF('ГРАФИК ПП'!H7>0,'ГРАФИК ПП'!H7,\" \")","v":"2022-03-21"},{"$f":"IF('ГРАФИК ПП'!I7>0,'ГРАФИК ПП'!I7,\" \")","v":"2022-03-25"},{"$f":"IF('ГРАФИК ПП'!$J7=\"TBD\",$F7,IF('ГРАФИК ПП'!$J7>0,'ГРАФИК ПП'!$J7,\" \"))","v":" "},{"$f":"IF('ГРАФИК ПП'!K7>0,'ГРАФИК ПП'!K7,\" \")","v":" "},{"$f":"IF(YEAR($F7)=$B$1,'ГРАФИК ПП'!$M7,0)","v":"???\nГрунда"},{"$f":"IF(YEAR($F7)=$B$1,CONCATENATE('ГРАФИК ПП'!N7,\", \",'ГРАФИК ПП'!O7),0)","v":"Рыбаков,  "},{"$f":"IF(YEAR($J7)=$B$1,'КОМАНДЫ ПП'!$R8,0)","v":{"$error":"#VALUE!"}},{"$f":"'ГРАФИК ПП'!Q7","v":"Базарев"},{"$f":"'КОМАНДЫ ПП'!T8","v":0},{"$f":"'КОМАНДЫ ПП'!U8","v":0},{"$f":"IF(YEAR($J7)=$B$1,'КОМАНДЫ ПП'!$V8,0)","v":{"$error":"#VALUE!"}},{"$f":"'КОМАНДЫ ПП'!W8","v":0},{"$f":"'КОМАНДЫ ПП'!X8","v":0},{"$f":"'КОМАНДЫ ПП'!Y8","v":0},{"$f":"'КОМАНДЫ ПП'!Z8","v":0},{"$f":"'КОМАНДЫ ПП'!AA8","v":0},{"$f":"'КОМАНДЫ ПП'!AB8","v":0},{"$f":"'КОМАНДЫ ПП'!AC8","v":0},{"$f":"'КОМАНДЫ ПП'!AD8","v":0},{"$f":"'КОМАНДЫ ПП'!AE8","v":0},{"$f":"'КОМАНДЫ ПП'!AF8","v":0},{"$f":"'КОМАНДЫ ПП'!AG8","v":0}]
[null,"АЭС Торнесс","Великобриттания","WPR_ПЦ",{"$f":"CONCATENATE(B8,\", \",D8,\", TL: \",L8,\", CC: \",M8,\", \",#REF!)","v":{"$error":"#REF!"}},{"$f":"IF('ГРАФИК ПП'!F8>0,'ГРАФИК ПП'!F8,\" \")","v":"2022-08-11"},{"$f":"IF('ГРАФИК ПП'!G8>0,'ГРАФИК ПП'!G8,\" \")","v":"2022-08-27"},{"$f":"IF('ГРАФИК ПП'!H8>0,'ГРАФИК ПП'!H8,\" \")","v":"2022-02-14"},{"$f":"IF('ГРАФИК ПП'!I8>0,'ГРАФИК ПП'!I8,\" \")","v":"2022-02-18"},{"$f":"IF('ГРАФИК ПП'!$J8=\"TBD\",$F8,IF('ГРАФИК ПП'!$J8>0,'ГРАФИК ПП'!$J8,\" \"))","v":"2022-04-18"},{"$f":"IF('ГРАФИК ПП'!K8>0,'ГРАФИК ПП'!K8,\" \")","v":"2022-04-29"},{"$f":"IF(YEAR($F8)=$B$1,'ГРАФИК ПП'!$M8,0)","v":"Дыроватый"},{"$f":"IF(YEAR($F8)=$B$1,CONCATENATE('ГРАФИК ПП'!N8,\", \",'ГРАФИК ПП'!O8),0)","v":"Альмикеев\nШирзади,  "},{"$f":"IF(YEAR($J8)=$B$1,'КОМАНДЫ ПП'!$R9,0)","v":"Рыбчук\nБазарев"},{"$f":"'ГРАФИК ПП'!Q8","v":"Альмикеев"},{"$f":"'КОМАНДЫ ПП'!T9","v":0},{"$f":"'КОМАНДЫ ПП'!U9","v":0},{"$f":"IF(YEAR($J8)=$B$1,'КОМАНДЫ ПП'!$V9,0)","v":0},{"$f":"'КОМАНДЫ ПП'!W9","v":0},{"$f":"'КОМАНДЫ ПП'!X9","v":0},{"$f":"'КОМАНДЫ ПП'!Y9","v":0},{"$f":"'КОМАНДЫ ПП'!Z9","v":0},{"$f":"'КОМАНДЫ ПП'!AA9","v":0},{"$f":"'КОМАНДЫ ПП'!AB9","v":0},{"$f":"'КОМАНДЫ ПП'!AC9","v":0},{"$f":"'КОМАНДЫ ПП'!AD9","v":0},{"$f":"'КОМАНДЫ ПП'!AE9","v":0},{"$f":"'КОМАНДЫ ПП'!AF9","v":0},{"$f":"'КОМАНДЫ ПП'!AG9","v":0}]
[null,"АЭС Тяньвань 1-4","Китай","WPR5",{"$f":"CONCATENATE(B9,\", \",D9,\", TL: \",L9,\", CC: \",M9,\", \",#REF!)","v":{"$error":"#REF!"}},{"$f":"IF('ГРАФИК ПП'!F9>0,'ГРАФИК ПП'!F9,\" \")","v":"2022-08-25"},{"$f":"IF('ГРАФИК ПП'!G9>0,'ГРАФИК ПП'!G9,\" \")","v":"2022-09-10"},{"$f":"IF('ГРАФИК ПП'!H9>0,'ГРАФИК ПП'!H9,\" \")","v":"2022-04-25"},{"$f":"IF('ГРАФИК ПП'!I9>0,'ГРАФИК ПП'!I9,\" \")","v":"2022-04-29"},{"$f":"IF('ГРАФИК ПП'!$J9=\"TBD\",$F9,IF('ГРАФИК ПП'!$J9>0,'ГРАФИК ПП'!$J9,\" \"))","v":" "},{"$f":"IF('ГРАФИК ПП'!K9>0,'ГРАФИК ПП'!K9,\" \")","v":" "},{"$f":"IF(YEAR($F9)=$B$1,'ГРАФИК ПП'!$M9,0)","v":"Бойковский"},{"$f":"IF(YEAR($F9)=$B$1,CONCATENATE('ГРАФИК ПП'!N9,\", \",'ГРАФИК ПП'!O9),0)","v":"Лачков\nКенджецян,  "},{"$f":"IF(YEAR($J9)=$B$1,'КОМАНДЫ ПП'!$R10,0)","v":{"$error":"#VALUE!"}},{"$f":"'ГРАФИК ПП'!Q9","v":"Альмикеев"},{"$f":"'КОМАНДЫ ПП'!T10","v":0},{"$f":"'КОМАНДЫ ПП'!U10","v":0},{"$f":"IF(YEAR($J9)=$B$1,'КОМАНДЫ ПП'!$V10,0)","v":{"$error":"#VALUE!"}},{"$f":"'КОМАНДЫ ПП'!W10","v":0},{"$f":"'КОМАНДЫ ПП'!X10","v":0},{"$f":"'КОМАНДЫ ПП'!Y10","v":0},{"$f":"'КОМАНДЫ ПП'!Z10","v":0},{"$f":"'КОМАНДЫ ПП'!AA10","v":0},{"$f":"'КОМАНДЫ ПП'!AB10","v":0},{"$f":"'КОМАНДЫ ПП'!AC10","v":0},{"$f":"'КОМАНДЫ ПП'!AD10","v":0},{"$f":"'КОМАНДЫ ПП'!AE10","v":0},{"$f":"'КОМАНДЫ ПП'!AF10","v":0},{"$f":"'КОМАНДЫ ПП'!AG10","v":0}]
[null,"Нововоронежская АЭС","Россия","WPR5",{"$f":"CONCATENATE(B10,\", \",D10,\", TL: \",L10,\", CC: \",M10,\", \",#REF!)","v":{"$error":"#REF!"}},{"$f":"IF('ГРАФИК ПП'!F10>0,'ГРАФИК ПП'!F10,\" \")","v":"2022-10-06"},{"$f":"IF('ГРАФИК ПП'!G10>0,'ГРАФИК ПП'!G10,\" \")","v":"2022-10-21"},{"$f":"IF('ГРАФИК ПП'!H10>0,'ГРАФИК ПП'!H10,\" \")","v":"2022-04-25"},{"$f":"IF('ГРАФИК ПП'!I10>0,'ГРАФИК ПП'!I10,\" \")","v":"2022-04-29"},{"$f":"IF('ГРАФИК ПП'!$J10=\"TBD\",$F10,IF('ГРАФИК ПП'!$J10>0,'ГРАФИК ПП'!$J10,\" \"))","v":"2022-10-03"},{"$f":"IF('ГРАФИК ПП'!K10>0,'ГРАФИК ПП'!K10,\" \")","v":"2022-10-14"},{"$f":"IF(YEAR($F10)=$B$1,'ГРАФИК ПП'!$M10,0)","v":"Креницкий?"},{"$f":"IF(YEAR($F10)=$B$1,CONCATENATE('ГРАФИК ПП'!N10,\", \",'ГРАФИК ПП'!O10),0)","v":"Хромовских\nЩелик,  "},{"$f":"IF(YEAR($J10)=$B$1,'КОМАНДЫ ПП'!$R11,0)","v":"Шаров"},{"$f":"'ГРАФИК ПП'!Q10","v":"Хромовских"},{"$f":"'КОМАНДЫ ПП'!T11","v":0},{"$f":"'КОМАНДЫ ПП'!U11","v":0},{"$f":"IF(YEAR($J10)=$B$1,'КОМАНДЫ ПП'!$V11,0)","v":0},{"$f":"'КОМАНДЫ ПП'!W11","v":0},{"$f":"'КОМАНДЫ ПП'!X11","v":0},{"$f":"'КОМАНДЫ ПП'!Y11","v":0},{"$f":"'КОМАНДЫ ПП'!Z11","v":0},{"$f":"'КОМАНДЫ ПП'!AA11","v":0},{"$f":"'КОМАНДЫ ПП'!AB11","v":0},{"$f":"'КОМАНДЫ ПП'!AC11","v":0},{"$f":"'КОМАНДЫ ПП'!AD11","v":0},{"$f":"'КОМАНДЫ ПП'!AE11","v":0},{"$f":"'КОМАНДЫ ПП'!AF11","v":0},{"$f":"'КОМАНДЫ ПП'!AG11","v":0}]
[null,"Ривненская АЭС","Украина","WPR5",{"$f":"CONCATENATE(B11,\", \",D11,\", TL: \",L11,\", CC: \",M11,\", \",#REF!)","v":{"$error":"#REF!"}},{"$f":"IF('ГРАФИК ПП'!F11>0,'ГРАФИК ПП'!F11,\" \")","v":"2022-11-10"},{"$f":"IF('ГРАФИК ПП'!G11>0,'ГРАФИК ПП'!G11,\" \")","v":"2022-11-25"},{"$f":"IF('ГРАФИК ПП'!H11>0,'ГРАФИК ПП'!H11,\" \")","v":"2022-07-18"},{"$f":"IF('ГРАФИК ПП'!I11>0,'ГРАФИК ПП'!I11,\" \")","v":"2022-07-22"},{"$f":"IF('ГРАФИК ПП'!$J11=\"TBD\",$F11,IF('ГРАФИК ПП'!$J11>0,'ГРАФИК ПП'!$J11,\" \"))","v":" "},{"$f":"IF('ГРАФИК ПП'!K11>0,'ГРАФИК ПП'!K11,\" \")","v":" "},{"$f":"IF(YEAR($F11)=$B$1,'ГРАФИК ПП'!$M11,0)","v":"Бойковский\nГрунда?"},{"$f":"IF(YEAR($F11)=$B$1,CONCATENATE('ГРАФИК ПП'!N11,\", \",'ГРАФИК ПП'!O11),0)","v":"Отченашев\nКопылов\n,  "},{"$f":"IF(YEAR($J11)=$B$1,'КОМАНДЫ ПП'!$R12,0)","v":{"$error":"#VALUE!"}},{"$f":"'ГРАФИК ПП'!Q11","v":"Базарев"},{"$f":"'КОМАНДЫ ПП'!T12","v":0},{"$f":"'КОМАНДЫ ПП'!U12","v":0},{"$f":"IF(YEAR($J11)=$B$1,'КОМАНДЫ ПП'!$V12,0)","v":{"$error":"#VALUE!"}},{"$f":"'КОМАНДЫ ПП'!W12","v":0},{"$f":"'КОМАНДЫ ПП'!X12","v":0},{"$f":"'КОМАНДЫ ПП'!Y12","v":0},{"$f":"'КОМАНДЫ ПП'!Z12","v":0},{"$f":"'КОМАНДЫ ПП'!AA12","v":0},{"$f":"'КОМАНДЫ ПП'!AB12","v":0},{"$f":"'КОМАНДЫ ПП'!AC12","v":0},{"$f":"'КОМАНДЫ ПП'!AD12","v":0},{"$f":"'КОМАНДЫ ПП'!AE12","v":0},{"$f":"'КОМАНДЫ ПП'!AF12","v":0},{"$f":"'КОМАНДЫ ПП'!AG12","v":0}]
[null,"Смоленская АЭС","Россия","WPR5",{"$f":"CONCATENATE(B12,\", \",D12,\", TL: \",L12,\", CC: \",M12,\", \",#REF!)","v":{"$error":"#N/A"}},{"$f":"IF('ГРАФИК ПП'!F12>0,'ГРАФИК ПП'!F12,\" \")","v":{"$error":"#N/A"}},{"$f":"IF('ГРАФИК ПП'!G12>0,'ГРАФИК ПП'!G12,\" \")","v":{"$error":"#N/A"}},{"$f":"IF('ГРАФИК ПП'!H12>0,'ГРАФИК ПП'!H12,\" \")","v":{"$error":"#N/A"}},{"$f":"IF('ГРАФИК ПП'!I12>0,'ГРАФИК ПП'!I12,\" \")","v":{"$error":"#N/A"}},{"$f":"IF('ГРАФИК ПП'!$J12=\"TBD\",$F12,IF('ГРАФИК ПП'!$J12>0,'ГРАФИК ПП'!$J12,\" \"))","v":{"$error":"#N/A"}},{"$f":"IF('ГРАФИК ПП'!K12>0,'ГРАФИК ПП'!K12,\" \")","v":{"$error":"#N/A"}},{"$f":"IF(YEAR($F12)=$B$1,'ГРАФИК ПП'!$M12,0)","v":{"$error":"#N/A"}},{"$f":"IF(YEAR($F12)=$B$1,CONCATENATE('ГРАФИК ПП'!N12,\", \",'ГРАФИК ПП'!O12),0)","v":{"$error":"#N/A"}},{"$f":"IF(YEAR($J12)=$B$1,'КОМАНДЫ ПП'!$R13,0)","v":{"$error":"#N/A"}},{"$f":"'ГРАФИК ПП'!Q12","v":{"$error":"#N/A"}},{"$f":"'КОМАНДЫ ПП'!T13","v":0},{"$f":"'КОМАНДЫ ПП'!U13","v":0},{"$f":"IF(YEAR($J12)=$B$1,'КОМАНДЫ ПП'!$V13,0)","v":{"$error":"#N/A"}},{"$f":"'КОМАНДЫ ПП'!W13","v":0},{"$f":"'КОМАНДЫ ПП'!X13","v":0},{"$f":"'КОМАНДЫ ПП'!Y13","v":0},{"$f":"'КОМАНДЫ ПП'!Z13","v":0},{"$f":"'КОМАНДЫ ПП'!AA13","v":0},{"$f":"'КОМАНДЫ ПП'!AB13","v":0},{"$f":"'КОМАНДЫ ПП'!AC13","v":0},{"$f":"'КОМАНДЫ ПП'!AD13","v":0},{"$f":"'КОМАНДЫ ПП'!AE13","v":0},{"$f":"'КОМАНДЫ ПП'!AF13","v":0},{"$f":"'КОМАНДЫ ПП'!AG13","v":0}]
[null,"Кольская АЭС","Россия","WPR5",{"$f":"CONCATENATE(B13,\", \",D13,\", TL: \",L13,\", CC: \",M13,\", \",#REF!)","v":{"$error":"#N/A"}},{"$f":"IF('ГРАФИК ПП'!F13>0,'ГРАФИК ПП'!F13,\" \")","v":{"$error":"#N/A"}},{"$f":"IF('ГРАФИК ПП'!G13>0,'ГРАФИК ПП'!G13,\" \")","v":{"$error":"#N/A"}},{"$f":"IF('ГРАФИК ПП'!H13>0,'ГРАФИК ПП'!H13,\" \")","v":{"$error":"#N/A"}},{"$f":"IF('ГРАФИК ПП'!I13>0,'ГРАФИК ПП'!I13,\" \")","v":{"$error":"#N/A"}},{"$f":"IF('ГРАФИК ПП'!$J13=\"TBD\",$F13,IF('ГРАФИК ПП'!$J13>0,'ГРАФИК ПП'!$J13,\" \"))","v":{"$error":"#N/A"}},{"$f":"IF('ГРАФИК ПП'!K13>0,'ГРАФИК ПП'!K13,\" \")","v":{"$error":"#N/A"}},{"$f":"IF(YEAR($F13)=$B$1,'ГРАФИК ПП'!$M13,0)","v":{"$error":"#N/A"}},{"$f":"IF(YEAR($F13)=$B$1,CONCATENATE('ГРАФИК ПП'!N13,\", \",'ГРАФИК ПП'!O13),0)","v":{"$error":"#N/A"}},{"$f":"IF(YEAR($J13)=$B$1,'КОМАНДЫ ПП'!$R14,0)","v":{"$error":"#N/A"}},{"$f":"'ГРАФИК ПП'!Q13","v":{"$error":"#N/A"}},{"$f":"'КОМАНДЫ ПП'!T14","v":0},{"$f":"'КОМАНДЫ ПП'!U14","v":0},{"$f":"IF(YEAR($J13)=$B$1,'КОМАНДЫ ПП'!$V14,0)","v":{"$error":"#N/A"}},{"$f":"'КОМАНДЫ ПП'!W14","v":0},{"$f":"'КОМАНДЫ ПП'!X14","v":0},{"$f":"'КОМАНДЫ ПП'!Y14","v":0},{"$f":"'КОМАНДЫ ПП'!Z14","v":0},{"$f":"'КОМАНДЫ ПП'!AA14","v":0},{"$f":"'КОМАНДЫ ПП'!AB14","v":0},{"$f":"'КОМАНДЫ ПП'!AC14","v":0},{"$f":"'КОМАНДЫ ПП'!AD14","v":0},{"$f":"'КОМАНДЫ ПП'!AE14","v":0},{"$f":"'КОМАНДЫ ПП'!AF14","v":0},{"$f":"'КОМАНДЫ ПП'!AG14","v":0}]
[null,"Армянская АЭС","Армения","WPR5",{"$f":"CONCATENATE(B14,\", \",D14,\", TL: \",L14,\", CC: \",M14,\", \",#REF!)","v":{"$error":"#REF!"}},{"$f":"IF('ГРАФИК ПП'!#REF!>0,'ГРАФИК ПП'!#REF!,\" \")","v":{"$error":"#REF!"}},{"$f":"IF('ГРАФИК ПП'!#REF!>0,'ГРАФИК ПП'!#REF!,\" \")","v":{"$error":"#REF!"}},{"$f":"IF('ГРАФИК ПП'!#REF!>0,'ГРАФИК ПП'!#REF!,\" \")","v":{"$error":"#REF!"}},{"$f":"IF('ГРАФИК ПП'!#REF!>0,'ГРАФИК ПП'!#REF!,\" \")","v":{"$error":"#REF!"}},{"$f":"IF('ГРАФИК ПП'!#REF!=\"TBD\",$F14,IF('ГРАФИК ПП'!#REF!>0,'ГРАФИК ПП'!#REF!,\" \"))","v":{"$error":"#REF!"}},{"$f":"IF('ГРАФИК ПП'!#REF!>0,'ГРАФИК ПП'!#REF!,\" \")","v":{"$error":"#REF!"}},{"$f":"IF(YEAR($F14)=$B$1,'ГРАФИК ПП'!#REF!,0)","v":{"$error":"#REF!"}},{"$f":"IF(YEAR($F14)=$B$1,CONCATENATE('ГРАФИК ПП'!#REF!,\", \",'ГРАФИК ПП'!#REF!),0)","v":{"$error":"#REF!"}},{"$f":"IF(YEAR($J14)=$B$1,'КОМАНДЫ ПП'!#REF!,0)","v":{"$error":"#REF!"}},{"$f":"'ГРАФИК ПП'!#REF!","v":{"$error":"#REF!"}},{"$f":"'КОМАНДЫ ПП'!#REF!","v":{"$error":"#REF!"}},{"$f":"'КОМАНДЫ ПП'!#REF!","v":{"$error":"#REF!"}},{"$f":"IF(YEAR($J14)=$B$1,'КОМАНДЫ ПП'!#REF!,0)","v":{"$error":"#REF!"}},{"$f":"'КОМАНДЫ ПП'!#REF!","v":{"$error":"#REF!"}},{"$f":"'КОМАНДЫ ПП'!#REF!","v":{"$error":"#REF!"}},{"$f":"'КОМАНДЫ ПП'!#REF!","v":{"$error":"#REF!"}},{"$f":"'КОМАНДЫ ПП'!#REF!","v":{"$error":"#REF!"}},{"$f":"'КОМАНДЫ ПП'!#REF!","v":{"$error":"#REF!"}},{"$f":"'КОМАНДЫ ПП'!#REF!","v":{"$error":"#REF!"}},{"$f":"'КОМАНДЫ ПП'!#REF!","v":{"$error":"#REF!"}},{"$f":"'КОМАНДЫ ПП'!#REF!","v":{"$error":"#REF!"}},{"$f":"'КОМАНДЫ ПП'!#REF!","v":{"$error":"#REF!"}},{"$f":"'КОМАНДЫ ПП'!#REF!","v":{"$error":"#REF!"}},{"$f":"'КОМАНДЫ ПП'!#REF!","v":{"$error":"#REF!"}}]
[null,"Курская АЭС","Россия","WPR5",{"$f":"CONCATENATE(B15,\", \",D15,\", TL: \",L15,\", CC: \",M15,\", \",#REF!)","v":{"$error":"#N/A"}},{"$f":"IF('ГРАФИК ПП'!F14>0,'ГРАФИК ПП'!F14,\" \")","v":{"$error":"#N/A"}},{"$f":"IF('ГРАФИК ПП'!G14>0,'ГРАФИК ПП'!G14,\" \")","v":{"$error":"#N/A"}},{"$f":"IF('ГРАФИК ПП'!H14>0,'ГРАФИК ПП'!H14,\" \")","v":{"$error":"#N/A"}},{"$f":"IF('ГРАФИК ПП'!I14>0,'ГРАФИК ПП'!I14,\" \")","v":{"$error":"#N/A"}},{"$f":"IF('ГРАФИК ПП'!$J14=\"TBD\",$F15,IF('ГРАФИК ПП'!$J14>0,'ГРАФИК ПП'!$J14,\" \"))","v":{"$error":"#N/A"}},{"$f":"IF('ГРАФИК ПП'!K14>0,'ГРАФИК ПП'!K14,\" \")","v":{"$error":"#N/A"}},{"$f":"IF(YEAR($F15)=$B$1,'ГРАФИК ПП'!$M14,0)","v":{"$error":"#N/A"}},{"$f":"IF(YEAR($F15)=$B$1,CONCATENATE('ГРАФИК ПП'!N14,\", \",'ГРАФИК ПП'!O14),0)","v":{"$error":"#N/A"}},{"$f":"IF(YEAR($J15)=$B$1,'КОМАНДЫ ПП'!$R15,0)","v":{"$error":"#N/A"}},{"$f":"'ГРАФИК ПП'!Q14","v":{"$error":"#N/A"}},{"$f":"'КОМАНДЫ ПП'!T15","v":0},{"$f":"'КОМАНДЫ ПП'!U15","v":0},{"$f":"IF(YEAR($J15)=$B$1,'КОМАНДЫ ПП'!$V15,0)","v":{"$error":"#N/A"}},{"$f":"'КОМАНДЫ ПП'!W15","v":0},{"$f":"'КОМАНДЫ ПП'!X15","v":0},{"$f":"'КОМАНДЫ ПП'!Y15","v":0},{"$f":"'КОМАНДЫ ПП'!Z15","v":0},{"$f":"'КОМАНДЫ ПП'!AA15","v":0},{"$f":"'КОМАНДЫ ПП'!AB15","v":0},{"$f":"'КОМАНДЫ ПП'!AC15","v":0},{"$f":"'КОМАНДЫ ПП'!AD15","v":0},{"$f":"'КОМАНДЫ ПП'!AE15","v":0},{"$f":"'КОМАНДЫ ПП'!AF15","v":0},{"$f":"'КОМАНДЫ ПП'!AG15","v":0}]
[null,"АЭС-Козлодуй","Болгария","WPR6",{"$f":"CONCATENATE(B16,\", \",D16,\", TL: \",L16,\", CC: \",M16,\", \",#REF!)","v":{"$error":"#N/A"}},{"$f":"IF('ГРАФИК ПП'!F15>0,'ГРАФИК ПП'!F15,\" \")","v":{"$error":"#N/A"}},{"$f":"IF('ГРАФИК ПП'!G15>0,'ГРАФИК ПП'!G15,\" \")","v":{"$error":"#N/A"}},{"$f":"IF('ГРАФИК ПП'!H15>0,'ГРАФИК ПП'!H15,\" \")","v":{"$error":"#N/A"}},{"$f":"IF('ГРАФИК ПП'!I15>0,'ГРАФИК ПП'!I15,\" \")","v":{"$error":"#N/A"}},{"$f":"IF('ГРАФИК ПП'!$J15=\"TBD\",$F16,IF('ГРАФИК ПП'!$J15>0,'ГРАФИК ПП'!$J15,\" \"))","v":{"$error":"#N/A"}},{"$f":"IF('ГРАФИК ПП'!K15>0,'ГРАФИК ПП'!K15,\" \")","v":{"$error":"#N/A"}},{"$f":"IF(YEAR($F16)=$B$1,'ГРАФИК ПП'!$M15,0)","v":{"$error":"#N/A"}},{"$f":"IF(YEAR($F16)=$B$1,CONCATENATE('ГРАФИК ПП'!N15,\", \",'ГРАФИК ПП'!O15),0)","v":{"$error":"#N/A"}},{"$f":"IF(YEAR($J16)=$B$1,'КОМАНДЫ ПП'!$R16,0)","v":{"$error":"#N/A"}},{"$f":"'ГРАФИК ПП'!Q15","v":{"$error":"#N/A"}},{"$f":"'КОМАНДЫ ПП'!T16","v":0},{"$f":"'КОМАНДЫ ПП'!U16","v":0},{"$f":"IF(YEAR($J16)=$B$1,'КОМАНДЫ ПП'!$V16,0)","v":{"$error":"#N/A"}},{"$f":"'КОМАНДЫ ПП'!W16","v":0},{"$f":"'КОМАНДЫ ПП'!X16","v":0},{"$f":"'КОМАНДЫ ПП'!Y16","v":0},{"$f":"'КОМАНДЫ ПП'!Z16","v":0},{"$f":"'КОМАНДЫ ПП'!AA16","v":0},{"$f":"'КОМАНДЫ ПП'!AB16","v":0},{"$f":"'КОМАНДЫ ПП'!AC16","v":0},{"$f":"'КОМАНДЫ ПП'!AD16","v":0},{"$f":"'КОМАНДЫ ПП'!AE16","v":0},{"$f":"'КОМАНДЫ ПП'!AF16","v":0},{"$f":"'КОМАНДЫ ПП'!AG16","v":0}]
[null,"Атомфлот, УАП Арктика","Россия","PSUR",{"$f":"CONCATENATE(B17,\", \",D17)","v":"Атомфлот, УАП Арктика, PSUR"},{"$f":"IF('ГРАФИК ПП'!F16>0,'ГРАФИК ПП'!F16,\" \")","v":"01.12.2022?"},{"$f":"IF('ГРАФИК ПП'!G16>0,'ГРАФИК ПП'!G16,\" \")","v":"2022-12-28"},{"$f":"IF('ГРАФИК ПП'!H16>0,'ГРАФИК ПП'!H16,\" \")","v":" "},{"$f":"IF('ГРАФИК ПП'!I16>0,'ГРАФИК ПП'!I16,\" \")","v":" "},{"$f":"IF('ГРАФИК ПП'!$J16=\"TBD\",$F17,IF('ГРАФИК ПП'!$J16>0,'ГРАФИК ПП'!$J16,\" \"))","v":" "},{"$f":"IF('ГРАФИК ПП'!K16>0,'ГРАФИК ПП'!K16,\" \")","v":" "},{"$f":"IF(YEAR($F17)=$B$1,'ГРАФИК ПП'!$M16,0)","v":{"$error":"#VALUE!"}},{"$f":"IF(YEAR($F17)=$B$1,CONCATENATE('ГРАФИК ПП'!N16,\", \",'ГРАФИК ПП'!O16),0)","v":{"$error":"#VALUE!"}},{"$f":"IF(YEAR($J17)=$B$1,'КОМАНДЫ ПП'!$R17,0)","v":{"$error":"#VALUE!"}},{"$f":"'ГРАФИК ПП'!Q16","v":0},{"$f":"'КОМАНДЫ ПП'!T17","v":0},{"$f":"'КОМАНДЫ ПП'!U17","v":0},{"$f":"IF(YEAR($J17)=$B$1,'КОМАНДЫ ПП'!$V17,0)","v":{"$error":"#VALUE!"}},{"$f":"'КОМАНДЫ ПП'!W17","v":0},{"$f":"'КОМАНДЫ ПП'!X17","v":0},{"$f":"'КОМАНДЫ ПП'!Y17","v":0},{"$f":"'КОМАНДЫ ПП'!Z17","v":0},{"$f":"'КОМАНДЫ ПП'!AA17","v":0},{"$f":"'КОМАНДЫ ПП'!AB17","v":0},{"$f":"'КОМАНДЫ ПП'!AC17","v":0},{"$f":"'КОМАНДЫ ПП'!AD17","v":0},{"$f":"'КОМАНДЫ ПП'!AE17","v":0},{"$f":"'КОМАНДЫ ПП'!AF17","v":0},{"$f":"'КОМАНДЫ ПП'!AG17","v":0}]
[null,"Атомфлот, УАП Сибирь","Россия","PSUR","Атомфлот, УАП Сибирь, PSUR",{"$f":"IF('ГРАФИК ПП'!F17>0,'ГРАФИК ПП'!F17,\" \")","v":"01.12.2022?"},{"$f":"IF('ГРАФИК ПП'!G17>0,'ГРАФИК ПП'!G17,\" \")","v":"2022-12-28"},{"$f":"IF('ГРАФИК ПП'!H17>0,'ГРАФИК ПП'!H17,\" \")","v":" "},{"$f":"IF('ГРАФИК ПП'!I17>0,'ГРАФИК ПП'!I17,\" \")","v":" "},{"$f":"IF('ГРАФИК ПП'!$J17=\"TBD\",$F18,IF('ГРАФИК ПП'!$J17>0,'ГРАФИК ПП'!$J17,\" \"))","v":" "},{"$f":"IF('ГРАФИК ПП'!K17>0,'ГРАФИК ПП'!K17,\" \")","v":" "},{"$f":"IF(YEAR($F18)=$B$1,'ГРАФИК ПП'!$M17,0)","v":{"$error":"#VALUE!"}},{"$f":"IF(YEAR($F18)=$B$1,CONCATENATE('ГРАФИК ПП'!N17,\", \",'ГРАФИК ПП'!O17),0)","v":{"$error":"#VALUE!"}},{"$f":"IF(YEAR($J18)=$B$1,'КОМАНДЫ ПП'!$R18,0)","v":{"$error":"#VALUE!"}},{"$f":"'ГРАФИК ПП'!Q17","v":0},{"$f":"'КОМАНДЫ ПП'!T18","v":0},{"$f":"'КОМАНДЫ ПП'!U18","v":0},{"$f":"IF(YEAR($J18)=$B$1,'КОМАНДЫ ПП'!$V18,0)","v":{"$error":"#VALUE!"}},{"$f":"'КОМАНДЫ ПП'!W18","v":0},{"$f":"'КОМАНДЫ ПП'!X18","v":0},{"$f":"'КОМАНДЫ ПП'!Y18","v":0},{"$f":"'КОМАНДЫ ПП'!Z18","v":0},{"$f":"'КОМАНДЫ ПП'!AA18","v":0},{"$f":"'КОМАНДЫ ПП'!AB18","v":0},{"$f":"'КОМАНДЫ ПП'!AC18","v":0},{"$f":"'КОМАНДЫ ПП'!AD18","v":0},{"$f":"'КОМАНДЫ ПП'!AE18","v":0},{"$f":"'КОМАНДЫ ПП'!AF18","v":0},{"$f":"'КОМАНДЫ ПП'!AG18","v":0}]
[null,"Белорусская-2","Беларусь","PSUR","Белорусская-2, PSUR",{"$f":"IF('ГРАФИК ПП'!F18>0,'ГРАФИК ПП'!F18,\" \")","v":{"$error":"#N/A"}},{"$f":"IF('ГРАФИК ПП'!G18>0,'ГРАФИК ПП'!G18,\" \")","v":{"$error":"#N/A"}},{"$f":"IF('ГРАФИК ПП'!H18>0,'ГРАФИК ПП'!H18,\" \")","v":{"$error":"#N/A"}},{"$f":"IF('ГРАФИК ПП'!I18>0,'ГРАФИК ПП'!I18,\" \")","v":{"$error":"#N/A"}},{"$f":"IF('ГРАФИК ПП'!$J18=\"TBD\",$F19,IF('ГРАФИК ПП'!$J18>0,'ГРАФИК ПП'!$J18,\" \"))","v":{"$error":"#N/A"}},{"$f":"IF('ГРАФИК ПП'!K18>0,'ГРАФИК ПП'!K18,\" \")","v":{"$error":"#N/A"}},{"$f":"IF(YEAR($F19)=$B$1,'ГРАФИК ПП'!$M18,0)","v":{"$error":"#N/A"}},{"$f":"IF(YEAR($F19)=$B$1,CONCATENATE('ГРАФИК ПП'!N18,\", \",'ГРАФИК ПП'!O18),0)","v":{"$error":"#N/A"}},{"$f":"IF(YEAR($J19)=$B$1,'КОМАНДЫ ПП'!$R19,0)","v":{"$error":"#N/A"}},{"$f":"'ГРАФИК ПП'!Q18","v":0},{"$f":"'КОМАНДЫ ПП'!T19","v":0},{"$f":"'КОМАНДЫ ПП'!U19","v":0},{"$f":"IF(YEAR($J19)=$B$1,'КОМАНДЫ ПП'!$V19,0)","v":{"$error":"#N/A"}},{"$f":"'КОМАНДЫ ПП'!W19","v":0},{"$f":"'КОМАНДЫ ПП'!X19","v":0},{"$f":"'КОМАНДЫ ПП'!Y19","v":0},{"$f":"'КОМАНДЫ ПП'!Z19","v":0},{"$f":"'КОМАНДЫ ПП'!AA19","v":0},{"$f":"'КОМАНДЫ ПП'!AB19","v":0},{"$f":"'КОМАНДЫ ПП'!AC19","v":0},{"$f":"'КОМАНДЫ ПП'!AD19","v":0},{"$f":"'КОМАНДЫ ПП'!AE19","v":0},{"$f":"'КОМАНДЫ ПП'!AF19","v":0},{"$f":"'КОМАНДЫ ПП'!AG19","v":0}]
[null,"Тяньвань-6","Китай","PSUR",{"$f":"CONCATENATE(B20,\", \",D20,\", TL: \",L20,\", CC: \",M20,\", \",#REF!)","v":{"$error":"#N/A"}},{"$f":"IF('ГРАФИК ПП'!F19>0,'ГРАФИК ПП'!F19,\" \")","v":{"$error":"#N/A"}},{"$f":"IF('ГРАФИК ПП'!G19>0,'ГРАФИК ПП'!G19,\" \")","v":{"$error":"#N/A"}},{"$f":"IF('ГРАФИК ПП'!H19>0,'ГРАФИК ПП'!H19,\" \")","v":{"$error":"#N/A"}},{"$f":"IF('ГРАФИК ПП'!I19>0,'ГРАФИК ПП'!I19,\" \")","v":{"$error":"#N/A"}},{"$f":"IF('ГРАФИК ПП'!$J19=\"TBD\",$F20,IF('ГРАФИК ПП'!$J19>0,'ГРАФИК ПП'!$J19,\" \"))","v":{"$error":"#N/A"}},{"$f":"IF('ГРАФИК ПП'!K19>0,'ГРАФИК ПП'!K19,\" \")","v":{"$error":"#N/A"}},{"$f":"IF(YEAR($F20)=$B$1,'ГРАФИК ПП'!$M19,0)","v":{"$error":"#N/A"}},{"$f":"IF(YEAR($F20)=$B$1,CONCATENATE('ГРАФИК ПП'!N19,\", \",'ГРАФИК ПП'!O19),0)","v":{"$error":"#N/A"}},{"$f":"IF(YEAR($J20)=$B$1,'КОМАНДЫ ПП'!$R20,0)","v":{"$error":"#N/A"}},{"$f":"'ГРАФИК ПП'!Q19","v":0},{"$f":"'КОМАНДЫ ПП'!T20","v":0},{"$f":"'КОМАНДЫ ПП'!U20","v":0},{"$f":"IF(YEAR($J20)=$B$1,'КОМАНДЫ ПП'!$V20,0)","v":{"$error":"#N/A"}},{"$f":"'КОМАНДЫ ПП'!W20","v":0},{"$f":"'КОМАНДЫ ПП'!X20","v":0},{"$f":"'КОМАНДЫ ПП'!Y20","v":0},{"$f":"'КОМАНДЫ ПП'!Z20","v":0},{"$f":"'КОМАНДЫ ПП'!AA20","v":0},{"$f":"'КОМАНДЫ ПП'!AB20","v":0},{"$f":"'КОМАНДЫ ПП'!AC20","v":0},{"$f":"'КОМАНДЫ ПП'!AD20","v":0},{"$f":"'КОМАНДЫ ПП'!AE20","v":0},{"$f":"'КОМАНДЫ ПП'!AF20","v":0},{"$f":"'КОМАНДЫ ПП'!AG20","v":0}]
[null,"АЭС Куданкулам","Индия","F-Up","АЭС Куданкулам, F-Up",{"$f":"IF('ГРАФИК ПП'!F20>0,'ГРАФИК ПП'!F20,\" \")","v":"2022-02-07"},{"$f":"IF('ГРАФИК ПП'!G20>0,'ГРАФИК ПП'!G20,\" \")","v":"2022-02-11"},{"$f":"IF('ГРАФИК ПП'!H20>0,'ГРАФИК ПП'!H20,\" \")","v":" "},{"$f":"IF('ГРАФИК ПП'!I20>0,'ГРАФИК ПП'!I20,\" \")","v":" "},null,null,{"$f":"IF(YEAR($F21)=$B$1,'ГРАФИК ПП'!$M20,0)","v":0},{"$f":"IF(YEAR($F21)=$B$1,CONCATENATE('ГРАФИК ПП'!N20,\", \",'ГРАФИК ПП'!O20),0)","v":"Лачков, "},{"$f":"IF(YEAR($J21)=$B$1,'КОМАНДЫ ПП'!$R21,0)","v":0},{"$f":"'ГРАФИК ПП'!Q20","v":0},{"$f":"'КОМАНДЫ ПП'!T21","v":0},{"$f":"'КОМАНДЫ ПП'!U21","v":0},{"$f":"IF(YEAR($J21)=$B$1,'КОМАНДЫ ПП'!$V21,0)","v":0},{"$f":"'КОМАНДЫ ПП'!W21","v":0},{"$f":"'КОМАНДЫ ПП'!X21","v":0},{"$f":"'КОМАНДЫ ПП'!Y21","v":0},{"$f":"'КОМАНДЫ ПП'!Z21","v":0},{"$f":"'КОМАНДЫ ПП'!AA21","v":0},{"$f":"'КОМАНДЫ ПП'!AB21","v":0},{"$f":"'КОМАНДЫ ПП'!AC21","v":0},{"$f":"'КОМАНДЫ ПП'!AD21","v":0},{"$f":"'КОМАНДЫ ПП'!AE21","v":0},{"$f":"'КОМАНДЫ ПП'!AF21","v":0},{"$f":"'КОМАНДЫ ПП'!AG21","v":0}]
[null,"АЭС Ловиса","Финляндия","F-Up","АЭС Ловиса, F-Up",{"$f":"IF('ГРАФИК ПП'!F21>0,'ГРАФИК ПП'!F21,\" \")","v":"2022-01-15"},{"$f":"IF('ГРАФИК ПП'!G21>0,'ГРАФИК ПП'!G21,\" \")","v":"2022-01-20"},{"$f":"IF('ГРАФИК ПП'!H21>0,'ГРАФИК ПП'!H21,\" \")","v":" "},{"$f":"IF('ГРАФИК ПП'!I21>0,'ГРАФИК ПП'!I21,\" \")","v":" "},null,null,{"$f":"IF(YEAR($F22)=$B$1,'ГРАФИК ПП'!$M21,0)","v":"Хаднадь"},{"$f":"IF(YEAR($F22)=$B$1,CONCATENATE('ГРАФИК ПП'!N21,\", \",'ГРАФИК ПП'!O21),0)","v":"Альмикеев, "},{"$f":"IF(YEAR($J22)=$B$1,'КОМАНДЫ ПП'!$R22,0)","v":0},{"$f":"'ГРАФИК ПП'!Q21","v":0},{"$f":"'КОМАНДЫ ПП'!T22","v":0},{"$f":"'КОМАНДЫ ПП'!U22","v":0},{"$f":"IF(YEAR($J22)=$B$1,'КОМАНДЫ ПП'!$V22,0)","v":0},{"$f":"'КОМАНДЫ ПП'!W22","v":0},{"$f":"'КОМАНДЫ ПП'!X22","v":"Базарев"},{"$f":"'КОМАНДЫ ПП'!Y22","v":0},{"$f":"'КОМАНДЫ ПП'!Z22","v":0},{"$f":"'КОМАНДЫ ПП'!AA22","v":"?????"},{"$f":"'КОМАНДЫ ПП'!AB22","v":0},{"$f":"'КОМАНДЫ ПП'!AC22","v":0},{"$f":"'КОМАНДЫ ПП'!AD22","v":0},{"$f":"'КОМАНДЫ ПП'!AE22","v":0},{"$f":"'КОМАНДЫ ПП'!AF22","v":0},{"$f":"'КОМАНДЫ ПП'!AG22","v":"Кузьмин"}]
[null,"ФГУП Атомфлот","Россия","F-Up","ФГУП Атомфлот, F-Up",{"$f":"IF('ГРАФИК ПП'!F22>0,'ГРАФИК ПП'!F22,\" \")","v":{"$error":"#N/A"}},{"$f":"IF('ГРАФИК ПП'!G22>0,'ГРАФИК ПП'!G22,\" \")","v":{"$error":"#N/A"}},{"$f":"IF('ГРАФИК ПП'!H22>0,'ГРАФИК ПП'!H22,\" \")","v":" "},{"$f":"IF('ГРАФИК ПП'!I22>0,'ГРАФИК ПП'!I22,\" \")","v":" "},null,null,{"$f":"IF(YEAR($F23)=$B$1,'ГРАФИК ПП'!$M22,0)","v":{"$error":"#N/A"}},{"$f":"IF(YEAR($F23)=$B$1,CONCATENATE('ГРАФИК ПП'!N22,\", \",'ГРАФИК ПП'!O22),0)","v":{"$error":"#N/A"}},{"$f":"IF(YEAR($J23)=$B$1,'КОМАНДЫ ПП'!$R23,0)","v":0},{"$f":"'ГРАФИК ПП'!Q22","v":0},{"$f":"'КОМАНДЫ ПП'!T23","v":0},{"$f":"'КОМАНДЫ ПП'!U23","v":0},{"$f":"IF(YEAR($J23)=$B$1,'КОМАНДЫ ПП'!$V23,0)","v":0},{"$f":"'КОМАНДЫ ПП'!W23","v":0},{"$f":"'КОМАНДЫ ПП'!X23","v":0},{"$f":"'КОМАНДЫ ПП'!Y23","v":0},{"$f":"'КОМАНДЫ ПП'!Z23","v":0},{"$f":"'КОМАНДЫ ПП'!AA23","v":0},{"$f":"'КОМАНДЫ ПП'!AB23","v":0},{"$f":"'КОМАНДЫ ПП'!AC23","v":0},{"$f":"'КОМАНДЫ ПП'!AD23","v":0},{"$f":"'КОМАНДЫ ПП'!AE23","v":0},{"$f":"'КОМАНДЫ ПП'!AF23","v":0},{"$f":"'КОМАНДЫ ПП'!AG23","v":0}]
[null,"Балаковкая АЭС","Россия","F-Up","Балаковкая АЭС, F-Up",{"$f":"IF('ГРАФИК ПП'!F23>0,'ГРАФИК ПП'!F23,\" \")","v":{"$error":"#N/A"}},{"$f":"IF('ГРАФИК ПП'!G23>0,'ГРАФИК ПП'!G23,\" \")","v":{"$error":"#N/A"}},{"$f":"IF('ГРАФИК ПП'!H23>0,'ГРАФИК ПП'!H23,\" \")","v":" "},{"$f":"IF('ГРАФИК ПП'!I23>0,'ГРАФИК ПП'!I23,\" \")","v":" "},null,null,{"$f":"IF(YEAR($F24)=$B$1,'ГРАФИК ПП'!$M23,0)","v":{"$error":"#N/A"}},{"$f":"IF(YEAR($F24)=$B$1,CONCATENATE('ГРАФИК ПП'!N23,\", \",'ГРАФИК ПП'!O23),0)","v":{"$error":"#N/A"}},{"$f":"IF(YEAR($J24)=$B$1,'КОМАНДЫ ПП'!$R24,0)","v":0},{"$f":"'ГРАФИК ПП'!Q23","v":0},{"$f":"'КОМАНДЫ ПП'!T24","v":0},{"$f":"'КОМАНДЫ ПП'!U24","v":0},{"$f":"IF(YEAR($J24)=$B$1,'КОМАНДЫ ПП'!$V24,0)","v":0},{"$f":"'КОМАНДЫ ПП'!W24","v":0},{"$f":"'КОМАНДЫ ПП'!X24","v":0},{"$f":"'КОМАНДЫ ПП'!Y24","v":0},{"$f":"'КОМАНДЫ ПП'!Z24","v":0},{"$f":"'КОМАНДЫ ПП'!AA24","v":0},{"$f":"'КОМАНДЫ ПП'!AB24","v":0},{"$f":"'КОМАНДЫ ПП'!AC24","v":0},{"$f":"'КОМАНДЫ ПП'!AD24","v":0},{"$f":"'КОМАНДЫ ПП'!AE24","v":0},{"$f":"'КОМАНДЫ ПП'!AF24","v":0},{"$f":"'КОМАНДЫ ПП'!AG24","v":0}]
[null,"Билибинская АЭС","Россия","F-Up","Билибинская АЭС, F-Up",{"$f":"IF('ГРАФИК ПП'!F24>0,'ГРАФИК ПП'!F24,\" \")","v":{"$error":"#N/A"}},{"$f":"IF('ГРАФИК ПП'!G24>0,'ГРАФИК ПП'!G24,\" \")","v":{"$error":"#N/A"}},{"$f":"IF('ГРАФИК ПП'!H24>0,'ГРАФИК ПП'!H24,\" \")","v":" "},{"$f":"IF('ГРАФИК ПП'!I24>0,'ГРАФИК ПП'!I24,\" \")","v":" "},null,null,{"$f":"IF(YEAR($F25)=$B$1,'ГРАФИК ПП'!$M24,0)","v":{"$error":"#N/A"}},{"$f":"IF(YEAR($F25)=$B$1,CONCATENATE('ГРАФИК ПП'!N24,\", \",'ГРАФИК ПП'!O24),0)","v":{"$error":"#N/A"}},{"$f":"IF(YEAR($J25)=$B$1,'КОМАНДЫ ПП'!$R25,0)","v":0},{"$f":"'ГРАФИК ПП'!Q24","v":0},{"$f":"'КОМАНДЫ ПП'!T25","v":0},{"$f":"'КОМАНДЫ ПП'!U25","v":0},{"$f":"IF(YEAR($J25)=$B$1,'КОМАНДЫ ПП'!$V25,0)","v":0},{"$f":"'КОМАНДЫ ПП'!W25","v":0},{"$f":"'КОМАНДЫ ПП'!X25","v":0},{"$f":"'КОМАНДЫ ПП'!Y25","v":0},{"$f":"'КОМАНДЫ ПП'!Z25","v":0},{"$f":"'КОМАНДЫ ПП'!AA25","v":0},{"$f":"'КОМАНДЫ ПП'!AB25","v":0},{"$f":"'КОМАНДЫ ПП'!AC25","v":0},{"$f":"'КОМАНДЫ ПП'!AD25","v":0},{"$f":"'КОМАНДЫ ПП'!AE25","v":0},{"$f":"'КОМАНДЫ ПП'!AF25","v":0},{"$f":"'КОМАНДЫ ПП'!AG25","v":0}]
[null,"АЭС Темелин","Чехия","F-Up","АЭС Темелин, F-Up",{"$f":"IF('ГРАФИК ПП'!F25>0,'ГРАФИК ПП'!F25,\" \")","v":{"$error":"#N/A"}},{"$f":"IF('ГРАФИК ПП'!G25>0,'ГРАФИК ПП'!G25,\" \")","v":{"$error":"#N/A"}},{"$f":"IF('ГРАФИК ПП'!H25>0,'ГРАФИК ПП'!H25,\" \")","v":" "},{"$f":"IF('ГРАФИК ПП'!I25>0,'ГРАФИК ПП'!I25,\" \")","v":" "},null,null,{"$f":"IF(YEAR($F26)=$B$1,'ГРАФИК ПП'!$M25,0)","v":{"$error":"#N/A"}},{"$f":"IF(YEAR($F26)=$B$1,CONCATENATE('ГРАФИК ПП'!N25,\", \",'ГРАФИК ПП'!O25),0)","v":{"$error":"#N/A"}},{"$f":"IF(YEAR($J26)=$B$1,'КОМАНДЫ ПП'!$R26,0)","v":0},{"$f":"'ГРАФИК ПП'!Q25","v":0},{"$f":"'КОМАНДЫ ПП'!T26","v":0},{"$f":"'КОМАНДЫ ПП'!U26","v":0},{"$f":"IF(YEAR($J26)=$B$1,'КОМАНДЫ ПП'!$V26,0)","v":0},{"$f":"'КОМАНДЫ ПП'!W26","v":0},{"$f":"'КОМАНДЫ ПП'!X26","v":0},{"$f":"'КОМАНДЫ ПП'!Y26","v":0},{"$f":"'КОМАНДЫ ПП'!Z26","v":0},{"$f":"'КОМАНДЫ ПП'!AA26","v":0},{"$f":"'КОМАНДЫ ПП'!AB26","v":0},{"$f":"'КОМАНДЫ ПП'!AC26","v":0},{"$f":"'КОМАНДЫ ПП'!AD26","v":0},{"$f":"'КОМАНДЫ ПП'!AE26","v":0},{"$f":"'КОМАНДЫ ПП'!AF26","v":0},{"$f":"'КОМАНДЫ ПП'!AG26","v":0}]
[null," Хмельницкая АЭС","Украина","F-Up"," Хмельницкая АЭС, F-Up",{"$f":"IF('ГРАФИК ПП'!F26>0,'ГРАФИК ПП'!F26,\" \")","v":{"$error":"#N/A"}},{"$f":"IF('ГРАФИК ПП'!G26>0,'ГРАФИК ПП'!G26,\" \")","v":{"$error":"#N/A"}},{"$f":"IF('ГРАФИК ПП'!H26>0,'ГРАФИК ПП'!H26,\" \")","v":" "},{"$f":"IF('ГРАФИК ПП'!I26>0,'ГРАФИК ПП'!I26,\" \")","v":" "},null,null,{"$f":"IF(YEAR($F27)=$B$1,'ГРАФИК ПП'!$M26,0)","v":{"$error":"#N/A"}},{"$f":"IF(YEAR($F27)=$B$1,CONCATENATE('ГРАФИК ПП'!N26,\", \",'ГРАФИК ПП'!O26),0)","v":{"$error":"#N/A"}},{"$f":"IF(YEAR($J27)=$B$1,'КОМАНДЫ ПП'!$R27,0)","v":0},{"$f":"'ГРАФИК ПП'!Q26","v":0},{"$f":"'КОМАНДЫ ПП'!T27","v":0},{"$f":"'КОМАНДЫ ПП'!U27","v":0},{"$f":"IF(YEAR($J27)=$B$1,'КОМАНДЫ ПП'!$V27,0)","v":0},{"$f":"'КОМАНДЫ ПП'!W27","v":0},{"$f":"'КОМАНДЫ ПП'!X27","v":0},{"$f":"'КОМАНДЫ ПП'!Y27","v":0},{"$f":"'КОМАНДЫ ПП'!Z27","v":0},{"$f":"'КОМАНДЫ ПП'!AA27","v":0},{"$f":"'КОМАНДЫ ПП'!AB27","v":0},{"$f":"'КОМАНДЫ ПП'!AC27","v":0},{"$f":"'КОМАНДЫ ПП'!AD27","v":0},{"$f":"'КОМАНДЫ ПП'!AE27","v":0},{"$f":"'КОМАНДЫ ПП'!AF27","v":0},{"$f":"'КОМАНДЫ ПП'!AG27","v":0}]
[null,"АЭС Бушер","Иран","F-Up","АЭС Бушер, F-Up",{"$f":"IF('ГРАФИК ПП'!F27>0,'ГРАФИК ПП'!F27,\" \")","v":{"$error":"#N/A"}},{"$f":"IF('ГРАФИК ПП'!G27>0,'ГРАФИК ПП'!G27,\" \")","v":{"$error":"#N/A"}},{"$f":"IF('ГРАФИК ПП'!H27>0,'ГРАФИК ПП'!H27,\" \")","v":" "},{"$f":"IF('ГРАФИК ПП'!I27>0,'ГРАФИК ПП'!I27,\" \")","v":" "},null,null,{"$f":"IF(YEAR($F28)=$B$1,'ГРАФИК ПП'!$M27,0)","v":{"$error":"#N/A"}},{"$f":"IF(YEAR($F28)=$B$1,CONCATENATE('ГРАФИК ПП'!N27,\", \",'ГРАФИК ПП'!O27),0)","v":{"$error":"#N/A"}},{"$f":"IF(YEAR($J28)=$B$1,'КОМАНДЫ ПП'!$R28,0)","v":0},{"$f":"'ГРАФИК ПП'!Q27","v":0},{"$f":"'КОМАНДЫ ПП'!T28","v":0},{"$f":"'КОМАНДЫ ПП'!U28","v":0},{"$f":"IF(YEAR($J28)=$B$1,'КОМАНДЫ ПП'!$V28,0)","v":0},{"$f":"'КОМАНДЫ ПП'!W28","v":0},{"$f":"'КОМАНДЫ ПП'!X28","v":0},{"$f":"'КОМАНДЫ ПП'!Y28","v":0},{"$f":"'КОМАНДЫ ПП'!Z28","v":0},{"$f":"'КОМАНДЫ ПП'!AA28","v":0},{"$f":"'КОМАНДЫ ПП'!AB28","v":0},{"$f":"'КОМАНДЫ ПП'!AC28","v":0},{"$f":"'КОМАНДЫ ПП'!AD28","v":0},{"$f":"'КОМАНДЫ ПП'!AE28","v":0},{"$f":"'КОМАНДЫ ПП'!AF28","v":0},{"$f":"'КОМАНДЫ ПП'!AG28","v":0}]

{"sheet":"ЗАГРУЖЕННОСТЬ","index":3,"n_rows":24,"n_cols":12,"rows_kept":24,"cut":false,"hidden":false,"merged":[]}
[]
[null,"Фамилия",null,"Всего мероприятий","Участие в ПП, ПППП на станциях МЦ в качестве CO&TL","Участие в  ППП на станциях МЦ в качестве CO&TL","Участие в ПП, ППП, ПППП на станциях МЦ в качестве CPO TL","Участие в ПП, ППП, ПППП на станциях МЦ в качестве экспертов","АНАЛИЗ DIR","Участие в ПП других РЦ","Участие в КПП","Другие мероприятия"]
[null,"Зинченко",{"$f":"\"*\"&B3&\"*\"","v":"*Зинченко*"},{"$f":"SUM(E3:L3)","v":0},{"$f":"COUNTIF('КОМАНДЫ ПП РАСЧ'!$L$4:$M$20,$C3)","v":0},{"$f":"COUNTIF('КОМАНДЫ ПП РАСЧ'!$L$21:$M$28,$C3)","v":0},{"$f":"COUNTIF('КОМАНДЫ ПП РАСЧ'!$N$4:$N$20,$C3)","v":0},{"$f":"COUNTIF('КОМАНДЫ ПП РАСЧ'!$R$4:$AC$28,$C3)","v":0},{"$f":"COUNTIF('ГРАФИК ПП'!$Q$4:$Q$27,$C3)","v":0}]
[null,"Аксёнов_С",{"$f":"\"*\"&B4&\"*\"","v":"*Аксёнов_С*"},{"$f":"SUM(E4:L4)","v":2},{"$f":"COUNTIF('КОМАНДЫ ПП РАСЧ'!$L$4:$M$20,$C4)","v":1},{"$f":"COUNTIF('КОМАНДЫ ПП РАСЧ'!$L$21:$M$28,$C4)","v":0},{"$f":"COUNTIF('КОМАНДЫ ПП РАСЧ'!$N$4:$N$20,$C4)","v":1},{"$f":"COUNTIF('КОМАНДЫ ПП РАСЧ'!$R$4:$AC$28,$C4)","v":0},{"$f":"COUNTIF('ГРАФИК ПП'!$Q$4:$Q$27,$C4)","v":0}]
[null,"Альмикеев",{"$f":"\"*\"&B5&\"*\"","v":"*Альмикеев*"},5,{"$f":"COUNTIF('КОМАНДЫ ПП РАСЧ'!$L$4:$M$20,$C5)","v":1},{"$f":"COUNTIF('КОМАНДЫ ПП РАСЧ'!$L$21:$M$28,$C5)","v":1},{"$f":"COUNTIF('КОМАНДЫ ПП РАСЧ'!$N$4:$N$20,$C5)","v":0},{"$f":"COUNTIF('КОМАНДЫ ПП РАСЧ'!$R$4:$AC$28,$C5)","v":0},{"$f":"COUNTIF('ГРАФИК ПП'!$Q$4:$Q$27,$C5)","v":3}]
[null,"Базарев","*Базарев*",5,{"$f":"COUNTIF('КОМАНДЫ ПП РАСЧ'!$L$4:$M$20,$C6)","v":0},{"$f":"COUNTIF('КОМАНДЫ ПП РАСЧ'!$L$21:$M$28,$C6)","v":0},{"$f":"COUNTIF('КОМАНДЫ ПП РАСЧ'!$N$4:$N$20,$C6)","v":1},{"$f":"COUNTIF('КОМАНДЫ ПП РАСЧ'!$R$4:$AC$28,$C6)","v":1},{"$f":"COUNTIF('ГРАФИК ПП'!$Q$4:$Q$27,$C6)","v":3}]
[null,"Галкин","*Галкин*",0,{"$f":"COUNTIF('КОМАНДЫ ПП РАСЧ'!$L$4:$M$20,$C7)","v":0},{"$f":"COUNTIF('КОМАНДЫ ПП РАСЧ'!$L$21:$M$28,$C7)","v":0},{"$f":"COUNTIF('КОМАНДЫ ПП РАСЧ'!$N$4:$N$20,$C7)","v":0},{"$f":"COUNTIF('КОМАНДЫ ПП РАСЧ'!$R$4:$AC$28,$C7)","v":0},{"$f":"COUNTIF('ГРАФИК ПП'!$Q$4:$Q$27,$C7)","v":0}]
[null,"Лачков","*Лачков*",3,{"$f":"COUNTIF('КОМАНДЫ ПП РАСЧ'!$L$4:$M$20,$C8)","v":2},{"$f":"COUNTIF('КОМАНДЫ ПП РАСЧ'!$L$21:$M$28,$C8)","v":1},{"$f":"COUNTIF('КОМАНДЫ ПП РАСЧ'!$N$4:$N$20,$C8)","v":0},{"$f":"COUNTIF('КОМАНДЫ ПП РАСЧ'!$R$4:$AC$28,$C8)","v":0},{"$f":"COUNTIF('ГРАФИК ПП'!$Q$4:$Q$27,$C8)","v":0}]
[null,"Отченашев","*Отченашев*",2,{"$f":"COUNTIF('КОМАНДЫ ПП РАСЧ'!$L$4:$M$20,$C9)","v":2},{"$f":"COUNTIF('КОМАНДЫ ПП РАСЧ'!$L$21:$M$28,$C9)","v":0},{"$f":"COUNTIF('КОМАНДЫ ПП РАСЧ'!$N$4:$N$20,$C9)","v":0},{"$f":"COUNTIF('КОМАНДЫ ПП РАСЧ'!$R$4:$AC$28,$C9)","v":0},{"$f":"COUNTIF('ГРАФИК ПП'!$Q$4:$Q$27,$C9)","v":0}]
[null,"Рыбаков","*Рыбаков*",1,{"$f":"COUNTIF('КОМАНДЫ ПП РАСЧ'!$L$4:$M$20,$C10)","v":1},{"$f":"COUNTIF('КОМАНДЫ ПП РАСЧ'!$L$21:$M$28,$C10)","v":0},{"$f":"COUNTIF('КОМАНДЫ ПП РАСЧ'!$N$4:$N$20,$C10)","v":0},{"$f":"COUNTIF('КОМАНДЫ ПП РАСЧ'!$R$4:$AC$28,$C10)","v":0},{"$f":"COUNTIF('ГРАФИК ПП'!$Q$4:$Q$27,$C10)","v":0}]
[null,"Хромовских","*Хромовских*",4,{"$f":"COUNTIF('КОМАНДЫ ПП РАСЧ'!$L$4:$M$20,$C11)","v":2},{"$f":"COUNTIF('КОМАНДЫ ПП РАСЧ'!$L$21:$M$28,$C11)","v":0},{"$f":"COUNTIF('КОМАНДЫ ПП РАСЧ'!$N$4:$N$20,$C11)","v":0},{"$f":"COUNTIF('КОМАНДЫ ПП РАСЧ'!$R$4:$AC$28,$C11)","v":0},{"$f":"COUNTIF('ГРАФИК ПП'!$Q$4:$Q$27,$C11)","v":2}]
[null,"Ширзади","*Ширзади*",2,{"$f":"COUNTIF('КОМАНДЫ ПП РАСЧ'!$L$4:$M$20,$C12)","v":1},{"$f":"COUNTIF('КОМАНДЫ ПП РАСЧ'!$L$21:$M$28,$C12)","v":0},{"$f":"COUNTIF('КОМАНДЫ ПП РАСЧ'!$N$4:$N$20,$C12)","v":0},{"$f":"COUNTIF('КОМАНДЫ ПП РАСЧ'!$R$4:$AC$28,$C12)","v":0},{"$f":"COUNTIF('ГРАФИК ПП'!$Q$4:$Q$27,$C12)","v":1}]
[null,"Шкребтан","*Шкребтан*",0,{"$f":"COUNTIF('КОМАНДЫ ПП РАСЧ'!$L$4:$M$20,$C13)","v":0},{"$f":"COUNTIF('КОМАНДЫ ПП РАСЧ'!$L$21:$M$28,$C13)","v":0},{"$f":"COUNTIF('КОМАНДЫ ПП РАСЧ'!$N$4:$N$20,$C13)","v":0},{"$f":"COUNTIF('КОМАНДЫ ПП РАСЧ'!$R$4:$AC$28,$C13)","v":0},{"$f":"COUNTIF('ГРАФИК ПП'!$Q$4:$Q$27,$C13)","v":0}]
[null,"Галстян","*Галстян*",0,{"$f":"COUNTIF('КОМАНДЫ ПП РАСЧ'!$L$4:$M$20,$C14)","v":0},{"$f":"COUNTIF('КОМАНДЫ ПП РАСЧ'!$L$21:$M$28,$C14)","v":0},{"$f":"COUNTIF('КОМАНДЫ ПП РАСЧ'!$N$4:$N$20,$C14)","v":0},{"$f":"COUNTIF('КОМАНДЫ ПП РАСЧ'!$R$4:$AC$28,$C14)","v":0},{"$f":"COUNTIF('ГРАФИК ПП'!$Q$4:$Q$27,$C14)","v":0}]
[null,"Фаллер","*Фаллер*",0,{"$f":"COUNTIF('КОМАНДЫ ПП РАСЧ'!$L$4:$M$20,$C15)","v":0},{"$f":"COUNTIF('КОМАНДЫ ПП РАСЧ'!$L$21:$M$28,$C15)","v":0},{"$f":"COUNTIF('КОМАНДЫ ПП РАСЧ'!$N$4:$N$20,$C15)","v":0},{"$f":"COUNTIF('КОМАНДЫ ПП РАСЧ'!$R$4:$AC$28,$C15)","v":0},{"$f":"COUNTIF('ГРАФИК ПП'!$Q$4:$Q$27,$C15)","v":0}]
[]
[null,"РЫБЧУК","*РЫБЧУК*",{"$f":"SUM(E17:L17)","v":2},{"$f":"COUNTIF('КОМАНДЫ ПП РАСЧ'!$L$4:$M$20,$C17)","v":1},{"$f":"COUNTIF('КОМАНДЫ ПП РАСЧ'!$L$21:$M$28,$C17)","v":0},{"$f":"COUNTIF('КОМАНДЫ ПП РАСЧ'!$N$4:$N$20,$C17)","v":1},{"$f":"COUNTIF('КОМАНДЫ ПП РАСЧ'!$R$4:$AC$28,$C17)","v":0},{"$f":"COUNTIF('ГРАФИК ПП'!$Q$4:$Q$27,$C17)","v":0}]
[null,"ДЫРОВАТЫЙ","*ДЫРОВАТЫЙ*",{"$f":"SUM(E18:L18)","v":1},{"$f":"COUNTIF('КОМАНДЫ ПП РАСЧ'!$L$4:$M$20,$C18)","v":1},{"$f":"COUNTIF('КОМАНДЫ ПП РАСЧ'!$L$21:$M$28,$C18)","v":0},{"$f":"COUNTIF('КОМАНДЫ ПП РАСЧ'!$N$4:$N$20,$C18)","v":0},{"$f":"COUNTIF('КОМАНДЫ ПП РАСЧ'!$R$4:$AC$28,$C18)","v":0},{"$f":"COUNTIF('ГРАФИК ПП'!$Q$4:$Q$27,$C18)","v":0}]
[null,"ШИШКИН","*ШИШКИН*",0,{"$f":"COUNTIF('КОМАНДЫ ПП РАСЧ'!$L$4:$M$20,$C19)","v":0},{"$f":"COUNTIF('КОМАНДЫ ПП РАСЧ'!$L$21:$M$28,$C19)","v":0},{"$f":"COUNTIF('КОМАНДЫ ПП РАСЧ'!$N$4:$N$20,$C19)","v":0},{"$f":"COUNTIF('КОМАНДЫ ПП РАСЧ'!$R$4:$AC$28,$C19)","v":0},{"$f":"COUNTIF('ГРАФИК ПП'!$Q$4:$Q$27,$C19)","v":0}]
[null,"БОЙКОВСКИ","*БОЙКОВСКИ*",3,{"$f":"COUNTIF('КОМАНДЫ ПП РАСЧ'!$L$4:$M$20,$C20)","v":3},{"$f":"COUNTIF('КОМАНДЫ ПП РАСЧ'!$L$21:$M$28,$C20)","v":0},{"$f":"COUNTIF('КОМАНДЫ ПП РАСЧ'!$N$4:$N$20,$C20)","v":0},{"$f":"COUNTIF('КОМАНДЫ ПП РАСЧ'!$R$4:$AC$28,$C20)","v":0},{"$f":"COUNTIF('ГРАФИК ПП'!$Q$4:$Q$27,$C20)","v":0}]
[null,"ХАДНАДЬ","*ХАДНАДЬ*",2,{"$f":"COUNTIF('КОМАНДЫ ПП РАСЧ'!$L$4:$M$20,$C21)","v":1},{"$f":"COUNTIF('КОМАНДЫ ПП РАСЧ'!$L$21:$M$28,$C21)","v":1},{"$f":"COUNTIF('КОМАНДЫ ПП РАСЧ'!$N$4:$N$20,$C21)","v":0},{"$f":"COUNTIF('КОМАНДЫ ПП РАСЧ'!$R$4:$AC$28,$C21)","v":0},{"$f":"COUNTIF('ГРАФИК ПП'!$Q$4:$Q$27,$C21)","v":0}]
[null,"ЛИВИНСКИЙ","*ЛИВИНСКИЙ*",0,{"$f":"COUNTIF('КОМАНДЫ ПП РАСЧ'!$L$4:$M$20,$C22)","v":0},{"$f":"COUNTIF('КОМАНДЫ ПП РАСЧ'!$L$21:$M$28,$C22)","v":0},{"$f":"COUNTIF('КОМАНДЫ ПП РАСЧ'!$N$4:$N$20,$C22)","v":0},{"$f":"COUNTIF('КОМАНДЫ ПП РАСЧ'!$R$4:$AC$28,$C22)","v":0},{"$f":"COUNTIF('ГРАФИК ПП'!$Q$4:$Q$27,$C22)","v":0}]
[null,"КРЕНИЦКИ","*КРЕНИЦКИ*",1,{"$f":"COUNTIF('КОМАНДЫ ПП РАСЧ'!$L$4:$M$20,$C23)","v":1},{"$f":"COUNTIF('КОМАНДЫ ПП РАСЧ'!$L$21:$M$28,$C23)","v":0},{"$f":"COUNTIF('КОМАНДЫ ПП РАСЧ'!$N$4:$N$20,$C23)","v":0},{"$f":"COUNTIF('КОМАНДЫ ПП РАСЧ'!$R$4:$AC$28,$C23)","v":0},{"$f":"COUNTIF('ГРАФИК ПП'!$Q$4:$Q$27,$C23)","v":0}]
[null,"ГРУНДА","*ГРУНДА*",2,{"$f":"COUNTIF('КОМАНДЫ ПП РАСЧ'!$L$4:$M$20,$C24)","v":2},{"$f":"COUNTIF('КОМАНДЫ ПП РАСЧ'!$L$21:$M$28,$C24)","v":0},{"$f":"COUNTIF('КОМАНДЫ ПП РАСЧ'!$N$4:$N$20,$C24)","v":0},{"$f":"COUNTIF('КОМАНДЫ ПП РАСЧ'!$R$4:$AC$28,$C24)","v":0},{"$f":"COUNTIF('ГРАФИК ПП'!$Q$4:$Q$27,$C24)","v":0}]

{"sheet":"ПЛАН ПП","index":4,"n_rows":30,"n_cols":27,"rows_kept":30,"cut":false,"hidden":true,"merged":[[1,20,1,21],[1,22,2,22],[1,23,1,24],[1,25,2,25],[1,26,2,26],[1,19,2,19],[0,0,0,18],[1,0,2,0],[1,1,2,1],[1,2,1,3],[1,4,2,4],[1,5,1,6],[1,7,2,7],[1,8,1,9],[1,10,2,10],[1,11,2,11],[1,12,1,13],[1,14,2,14],[1,15,1,16],[1,17,2,17],[1,18,2,18]]}
["8 летний график планирования проведения ПП\n(требоавния WPG 01)"]
["№","АЭС","Даты ПП",null,"Начало ППП согласно WPG 01","Даты ППП",null,"Начало след ПП согласно WPG01 ","Даты ПП",null,"Фактическое кол-во месяцев и дней между двумя ПП","Начало ППП согласно WPG 01","Даты ППП",null,"Начало след ПП согласно WPG01 ","Даты ПП",null,"Фактическое кол-во месяцев и дней между двумя ПП","Среднее кол-во месяцев и дней между тремя ПП","Начало ППП согласно WPG 01","Даты ППП",null,"Начало след ПП согласно WPG01 ","Даты ПП",null,"Фактическое кол-во месяцев и дней между двумя ПП","Среднее кол-во месяцев и дней между тремя ПП"]
[null,null,"Начало","Окончание",null,"Начало","Окончание",null,"Начало","Окончание",null,null,"Начало","Окончание",null,"Начало","Окончание",null,null,null,"Начало","Окончание",null,"Начало","Окончание"]
[1,"АЭС Пакш","2016-02-18","2016-03-04",{"$f":"D4+((H4-D4)/2)","v":"2018-02-25"},null,null,{"$f":"EDATE(C4,48)","v":"2020-02-18"},"2021-02-17","2021-03-05",{"$f":"IF(I4>0,DATEDIF(C4,I4,\"m\")&\" мес., \"&DATEDIF(C4,I4,\"md\")&\" дн.\",\" \")","v":"59 мес., 30 дн."},{"$f":"IF(J4>0,J4+((O4-J4)/2),\" \")","v":"2022-08-27"},null,null,{"$f":"IF(I4>0,IF(OR(EDATE(C4,48)<EDATE(I4,0),I4=0),EDATE(C4,96),EDATE(I4,48)),\" \")","v":"2024-02-18"},null,null,{"$f":"IF(P4>0,DATEDIF(I4,P4,\"m\")&\" мес., \"&DATEDIF(I4,P4,\"md\")&\" дн.\",\" \")","v":" "},{"$f":"IF(P4>0,DATEDIF(C4,P4,\"m\")/2&\" мес., \"&DATEDIF(C4,P4,\"md\")/2&\" дн.\",\" \")","v":" "},{"$f":"IF(Q4>0,Q4+((W4-Q4)/2),\" \")","v":" "},null,null,{"$f":"IF(P4>0,IF(OR(EDATE(I4,48)<EDATE(P4,0),P4=0),EDATE(I4,96),EDATE(P4,48)),\" \")","v":" "},null,null,{"$f":"IF(X4>0,DATEDIF(P4,X4,\"m\")&\" мес., \"&DATEDIF(P4,X4,\"md\")&\" дн.\",\" \")","v":" "},{"$f":"IF(X4>0,DATEDIF(I4,X4,\"m\")/2&\" мес., \"&DATEDIF(I4,X4,\"md\")/2&\" дн.\",\" \")","v":" "}]
[2,"Белоярская АЭС","2016-08-18","2016-09-02",{"$f":"D5+((H5-D5)/2)","v":"2018-08-26"},null,null,"2020-08-18","2021-03-25","2021-04-09",{"$f":"IF(I5>0,DATEDIF(C5,I5,\"m\")&\" мес., \"&DATEDIF(C5,I5,\"md\")&\" дн.\",\" \")","v":"55 мес., 7 дн."},"2022-12-13T12:00:00",null,null,{"$f":"IF(I5>0,IF(OR(EDATE(C5,48)<EDATE(I5,0),I5=0),EDATE(C5,96),EDATE(I5,48)),\" \")","v":"2024-08-18"},null,null,{"$f":"IF(P5>0,DATEDIF(I5,P5,\"m\")&\" мес., \"&DATEDIF(I5,P5,\"md\")&\" дн.\",\" \")","v":" "},{"$f":"IF(P5>0,DATEDIF(C5,P5,\"m\")/2&\" мес., \"&DATEDIF(C5,P5,\"md\")/2&\" дн.\",\" \")","v":" "},{"$f":"IF(Q5>0,Q5+((W5-Q5)/2),\" \")","v":" "},null,null,{"$f":"IF(P5>0,IF(OR(EDATE(I5,48)<EDATE(P5,0),P5=0),EDATE(I5,96),EDATE(P5,48)),\" \")","v":" "},null,null,{"$f":"IF(X5>0,DATEDIF(P5,X5,\"m\")&\" мес., \"&DATEDIF(P5,X5,\"md\")&\" дн.\",\" \")","v":" "},{"$f":"IF(X5>0,DATEDIF(I5,X5,\"m\")/2&\" мес., \"&DATEDIF(I5,X5,\"md\")/2&\" дн.\",\" \")","v":" "}]
[3,"Запорожская АЭС","2016-10-06","2016-10-21","2018-10-14",null,null,"2020-10-06","2021-05-13","2021-05-28","55 мес., 7 дн.","2023-01-31T12:00:00",null,null,"2024-10-06",null,null," "," "," ",null,null," ",null,null," "," "]
[4,"Ровенская АЭС","2016-10-24","2016-11-09","2018-11-01T12:00:00",null,null,"2020-10-24","2021-01-21","2021-02-05","50 мес., 28 дн.","2022-12-15T12:00:00",null,null,"2024-10-24",null,null," "," "," ",null,null," ",null,null," "," "]
[5,"Нововоронежская АЭС","2016-12-08","2016-12-23","2018-12-16",null,null,"2020-12-08","2020-11-24","2020-12-11","47 мес., 16 дн.","2022-12-03",null,null,"2024-11-24",null,null," "," "," ",null,null," ",null,null," "," "]
[6,"Кольская АЭС","2017-02-02","2017-02-17","2019-02-10",null,null,"2021-02-02","2021-10-14","2021-10-29","56 мес., 12 дн.","2023-06-17",null,null,"2025-02-02",null,null," "," "," ",null,null," ",null,null," "," "]
[7,"АЭС Дукованы","2017-03-23","2017-04-07","2019-03-31",null,null,"2021-03-23","2021-04-22","2021-05-07","48 мес., 30 дн.","2023-04-15",null,null,"2025-03-23",null,null," "," "," ",null,null," ",null,null," "," "]
[8,"Армянская АЭС","2017-08-24","2017-09-08","2019-09-01",null,null,"2021-08-24","2022-08-25","2022-09-10","60 мес., 1 дн.","2024-03-02T12:00:00",null,null,"2025-08-24",null,null," "," "," ",null,null," ",null,null," "," "]
[9,"АЭС Богунице","2017-09-14","2017-09-29","2019-09-22",null,null,"2021-09-14","2022-02-10","2022-02-25","52 мес., 27 дн.","2023-12-05T12:00:00",null,null,"2025-09-14",null,null," "," "," ",null,null," ",null,null," "," "]
[10,"Смоленская АЭС","2017-10-05","2017-10-20","2019-10-13",null,null,"2021-10-05","2021-09-23","2021-10-08","47 мес., 18 дн.","2023-10-01",null,null,"2025-09-23",null,null," "," "," ",null,null," ",null,null," "," "]
[11,"Курская АЭС","2017-11-08","2017-11-24","2019-11-16T12:00:00",null,null,"2021-11-08","2021-09-02","2021-09-17","45 мес., 25 дн.","2023-09-10",null,null,"2025-09-02",null,null," "," "," ",null,null," ",null,null," "," "]
[12,"АЭС Козлодуй","2017-11-23","2017-12-08","2019-12-01",null,null,"2021-11-23","2021-11-25","2021-12-10","48 мес., 2 дн.","2023-12-02",null,null,"2025-11-23",null,null," "," "," ",null,null," ",null,null," "," "]
[13,"АЭС Моховце","2018-03-15","2018-03-29","2020-03-21T12:00:00",null,null,"2022-03-15","2022-03-10","2022-03-25","47 мес., 23 дн.","2024-03-17",null,null,"2026-03-10",null,null," "," "," ",null,null," ",null,null," "," "]
[14,"Калининская АЭС","2018-08-30","2018-09-14","2020-09-06",null,null,"2022-08-30","2022-10-06","2022-10-21","49 мес., 6 дн.","2024-09-24T12:00:00",null,null,"2026-08-30",null,null," "," "," ",null,null," ",null,null," "," "]
[15,"Ленинградская АЭС","2018-09-13","2018-09-28","2020-09-20",null,null,"2022-09-13","2022-08-11","2022-08-27","46 мес., 29 дн.","2024-08-18T12:00:00",null,null,"2026-08-11",null,null," "," "," ",null,null," ",null,null," "," "]
[16,"ФГУП “Атомфлот”","2018-09-23","2018-10-05","2020-09-28T12:00:00",null,null,"2022-09-23","2022-07-25","2022-07-30","46 мес., 2 дн.","2024-07-27",null,null,"2026-07-25",null,null," "," "," ",null,null," ",null,null," "," "]
[17,"Южно-Украинская АЭС","2018-10-25","2018-11-09","2020-11-01",null,null,"2022-10-25",null,null," "," ",null,null," ",null,null," "," "," ",null,null," ",null,null," "," "]
[18,"Ростовская АЭС","2018-11-29","2018-12-14","2020-12-06",null,null,"2022-11-29","2022-11-10","2022-11-25","47 мес., 12 дн.","2024-11-17",null,null,"2026-11-10",null,null," "," "," ",null,null," ",null,null," "," "]
[19,"АЭС Куданкулам","2019-01-30","2019-02-15","2021-02-06T12:00:00","2021-02-08","2021-02-12","2023-01-30",null,null," "," ",null,null," ",null,null," "," "," ",null,null," ",null,null," "," "]
[20,"АЭС Ловиза","2019-03-14","2019-03-29","2021-03-21","2021-03-22","2021-03-26","2023-03-14",null,null," "," ",null,null," ",null,null," "," "," ",null,null," ",null,null," "," "]
[21,"АЭС Тяньвань","2019-04-11","2019-04-26","2021-04-18",null,null,"2023-04-11","2021-07-16","2021-07-30","27 мес., 5 дн.","2023-07-23T12:00:00",null,null,"2025-07-16",null,null," "," "," ",null,null," ",null,null," "," "]
[22,"Балаковская АЭС","2019-06-20","2019-07-06","2021-06-27T12:00:00","2021-06-07","2021-06-11","2023-06-20",null,null," "," ",null,null," ",null,null," "," "," ",null,null," ",null,null," "," "]
[23,"АЭС Темелин","2019-07-14","2019-08-02","2021-07-23",null,null,"2023-07-14",null,null," "," ",null,null," ",null,null," "," "," ",null,null," ",null,null," "," "]
[24,"Хмельницкая АЭС","2019-09-12","2019-09-28","2021-09-19T12:00:00","2021-09-06","2021-09-10","2023-09-12",null,null," "," ",null,null," ",null,null," "," "," ",null,null," ",null,null," "," "]
[25,"Билибинская АЭС","2019-09-26","2019-10-10","2021-10-02T12:00:00","2021-07-12","2021-07-16","2023-09-26",null,null," "," ",null,null," ",null,null," "," "," ",null,null," ",null,null," "," "]
[26,"АЭС Бушер","2019-11-19","2019-12-04","2021-11-26","2021-11-06","2021-11-10","2023-11-19",null,null," "," ",null,null," ",null,null," "," "," ",null,null," ",null,null," "," "]
[null,"АЭС Торнес","2016-05-23","2016-06-10",{"$f":"D30+((H30-D30)/2)","v":"2018-06-01T12:00:00"},null,null,"2020-05-23","2021-05-23",null,"60 мес., 0 дн."," ",null,null,"2024-05-23",null,null,null," "]

{"sheet":"ПЛАН ПП (2)","index":5,"n_rows":30,"n_cols":32,"rows_kept":30,"cut":false,"hidden":false,"merged":[[1,18,1,19],[1,20,1,21],[1,31,2,31],[1,0,2,0],[1,1,2,1],[1,26,1,27],[1,28,2,28],[1,29,1,30],[1,24,1,25],[1,22,1,23],[1,10,1,11],[1,2,1,3],[1,4,1,5],[1,6,1,7],[1,14,1,15],[1,8,1,9],[1,12,1,13],[1,16,1,17]]}
["8 летний график планирования проведения ПП"]
["№","АЭС","Даты WPR1",null,"Даты F-Up WPR1",null,"Даты WPR2",null,"Даты F-Up WPR2",null,"Даты WPR3",null,"Даты F-Up WPR3",null,"Даты WPR4",null,"Даты F-Up WPR4",null,"Даты WPR5",null,"Даты F-Up WPR5",null,"Даты WPR6",null,"Даты F-Up WPR6",null,"Даты ПП",null,"План. след ПП согласно WPG01 ","Даты ПП",null,"Фактическое кол-во месяцев и дней между двумя ПП"]
[null,null,"Начало","Окончание","Начало","Окончание","Начало","Окончание","Начало","Окончание","Начало","Окончание","Начало","Окончание","Начало","Окончание","Начало","Окончание","Начало","Окончание","Начало","Окончание","Начало","Окончание","Начало","Окончание","Начало","Окончание",null,"Начало","Окончание"]
[1,"АЭС Пакш",null,null,null,null,null,null,null,null,null,null,null,null,"2016-02-18","2016-03-04",null,null,"2021-02-17","2021-03-05",null,null,null,null,null,null,"2016-02-18","2016-03-04",{"$f":"EDATE(O4,48)","v":"2020-02-18"},"2021-02-17","2021-03-05",{"$f":"IF(S4>0,DATEDIF(O4,S4,\"m\")&\" мес., \"&DATEDIF(O4,S4,\"md\")&\" дн.\",\" \")","v":"59 мес., 30 дн."}]
[2,"Белоярская АЭС",null,null,null,null,null,null,null,null,null,null,null,null,"2016-08-18","2016-09-02",null,null,"2021-03-25","2021-04-09",null,null,null,null,null,null,"2016-08-18","2016-09-02","2020-08-18","2021-03-25","2021-04-09","55 мес., 7 дн."]
[3,"Запорожская АЭС",null,null,null,null,null,null,null,null,null,null,null,null,"2016-10-06","2016-10-21",null,null,"2021-05-13","2021-05-28",null,null,null,null,null,null,"2016-10-06","2016-10-21","2020-10-06","2021-05-13","2021-05-28","55 мес., 7 дн."]
[4,"Ривненская АЭС",null,null,null,null,null,null,null,null,null,null,null,null,"2016-10-24","2016-11-09",null,null,"2021-09-02","2021-09-17",null,null,null,null,null,null,"2016-10-24","2016-11-09","2020-10-24","2021-01-21","2021-02-05","58 мес., 9 дн."]
[5,"Нововоронежская АЭС",null,null,null,null,null,null,null,null,null,null,null,null,"2016-12-08","2016-12-23",null,null,"2021-08-01","2021-08-31",null,null,null,null,null,null,"2016-12-08","2016-12-23","2020-12-08","2020-11-24","2020-12-11","55 мес., 24 дн."]
[6,"Кольская АЭС",null,null,null,null,null,null,null,null,null,null,null,null,"2017-02-02","2017-02-17",null,null,"2021-10-14","2021-10-29",null,null,null,null,null,null,"2017-02-02","2017-02-17","2021-02-02","2021-10-14","2021-10-29","56 мес., 12 дн."]
[7,"АЭС Дукованы",null,null,null,null,null,null,null,null,null,null,null,null,"2017-03-23","2017-04-07",null,null,"2021-04-22","2021-05-07",null,null,null,null,null,null,"2017-03-23","2017-04-07","2021-03-23","2021-04-22","2021-05-07","48 мес., 30 дн."]
[8,"Армянская АЭС",null,null,null,null,null,null,null,null,null,null,null,null,"2017-08-24","2017-09-08",null,null,"2022-08-25","2022-09-10",null,null,null,null,null,null,"2017-08-24","2017-09-08","2021-08-24","2021-11-04","2021-11-19","60 мес., 1 дн."]
[9,"АЭС Богунице",null,null,null,null,null,null,null,null,null,null,null,null,"2017-09-14","2017-09-29",null,null,"2022-02-10","2022-02-25",null,null,null,null,null,null,"2017-09-14","2017-09-29","2021-09-14",null,null,"52 мес., 27 дн."]
[10,"Смоленская АЭС",null,null,null,null,null,null,null,null,null,null,null,null,"2017-10-05","2017-10-20",null,null,"2021-09-23","2021-10-08",null,null,null,null,null,null,"2017-10-05","2017-10-20","2021-10-05","2021-09-23","2021-10-08","47 мес., 18 дн."]
[11,"Курская АЭС",null,null,null,null,null,null,null,null,null,null,null,null,"2017-11-08","2017-11-24",null,null,"2021-11-25","2021-12-10",null,null,null,null,null,null,"2017-11-08","2017-11-24","2021-11-08","2021-09-02","2021-09-17","48 мес., 17 дн."]
[12,"АЭС Козлодуй",null,null,null,null,null,null,null,null,null,null,null,null,null,null,null,null,"2017-11-23","2017-12-08",null,null,"2021-11-25","2021-12-10",null,null,"2017-11-23","2017-12-08",{"$f":"EDATE(S15,48)","v":"2021-11-23"},"2021-11-25","2021-12-10",{"$f":"IF(W15>0,DATEDIF(S15,W15,\"m\")&\" мес., \"&DATEDIF(S15,W15,\"md\")&\" дн.\",\" \")","v":"48 мес., 2 дн."}]
[13,"АЭС Моховце",null,null,null,null,null,null,null,null,null,null,null,null,"2018-03-15","2018-03-29",null,null,"2022-03-10","2022-03-25",null,null,null,null,null,null,"2018-03-15","2018-03-29",{"$f":"EDATE(O16,48)","v":"2022-03-15"},null,null,{"$f":"IF(S16>0,DATEDIF(O16,S16,\"m\")&\" мес., \"&DATEDIF(O16,S16,\"md\")&\" дн.\",\" \")","v":"47 мес., 23 дн."}]
[14,"Калининская АЭС",null,null,null,null,null,null,null,null,null,null,null,null,"2018-08-30","2018-09-14",null,null,"2022-10-06","2022-10-21",null,null,null,null,null,null,"2018-08-30","2018-09-14","2022-08-30",null,null,"49 мес., 6 дн."]
[15,"Ленинградская АЭС",null,null,null,null,null,null,null,null,null,null,null,null,"2018-09-13","2018-09-28",null,null,"2022-08-11","2022-08-27",null,null,null,null,null,null,"2018-09-13","2018-09-28","2022-09-13",null,null,"46 мес., 29 дн."]
[16,"ФГУП “Атомфлот”",null,null,null,null,null,null,null,null,null,null,null,null,"2018-09-23","2018-10-05",null,null,"2022-07-25","2022-07-30",null,null,null,null,null,null,"2018-09-23","2018-10-05","2022-09-23",null,null,"46 мес., 2 дн."]
[17,"Южно-Украинская АЭС",null,null,null,null,null,null,null,null,null,null,null,null,"2018-10-25","2018-11-09",null,null,null,null,null,null,null,null,null,null,"2018-10-25","2018-11-09","2022-10-25",null,null," "]
[18,"Ростовская АЭС",null,null,null,null,null,null,null,null,null,null,null,null,"2018-11-29","2018-12-14",null,null,"2022-11-10","2022-11-25",null,null,null,null,null,null,"2018-11-29","2018-12-14","2022-11-29",null,null,"47 мес., 12 дн."]
[19,"АЭС Куданкулам",null,null,null,null,null,null,null,null,null,null,null,null,"2019-01-30","2019-02-15","2021-02-08","2021-02-12",null,null,null,null,null,null,null,null,"2019-01-30","2019-02-15","2023-01-30",null,null," "]
[20,"АЭС Ловиза",null,null,null,null,null,null,null,null,null,null,null,null,"2019-03-14","2019-03-29","2021-03-22","2021-03-26",null,null,null,null,null,null,null,null,"2019-03-14","2019-03-29","2023-03-14",null,null," "]
[21,"АЭС Тяньвань 1-4",null,null,null,null,null,null,null,null,null,null,null,null,"2019-04-11","2019-04-26",null,null,"2021-07-16","2021-07-30",null,null,null,null,null,null,"2019-04-11","2019-04-26","2023-04-11","2021-07-16","2021-07-30","27 мес., 5 дн."]
[22,"Балаковская АЭС",null,null,null,null,null,null,null,null,null,null,null,null,"2019-06-20","2019-07-06","2021-06-07","2021-06-11",null,null,null,null,null,null,null,null,"2019-06-20","2019-07-06","2023-06-20",null,null," "]
[23,"АЭС Темелин",null,null,null,null,null,null,null,null,null,null,null,null,"2019-07-14","2019-08-02",null,null,null,null,null,null,null,null,null,null,"2019-07-14","2019-08-02","2023-07-14",null,null," "]
[24,"Хмельницкая АЭС",null,null,null,null,null,null,null,null,null,null,null,null,"2019-09-12","2019-09-28","2021-09-06","2021-09-10",null,null,null,null,null,null,null,null,"2019-09-12","2019-09-28","2023-09-12",null,null," "]
[25,"Билибинская АЭС",null,null,null,null,null,null,null,null,null,null,null,null,"2019-09-26","2019-10-10","2021-07-12","2021-07-16",null,null,null,null,null,null,null,null,"2019-09-26","2019-10-10","2023-09-26",null,null," "]
[26,"АЭС Бушер",null,null,null,null,null,null,null,null,null,null,null,null,"2019-11-19","2019-12-04","2021-11-06","2021-11-10",null,null,null,null,null,null,null,null,"2019-11-19","2019-12-04","2023-11-19",null,null," "]
[null,null,null,null,null,null,null,null,null,null,null,null,null,null,null,null,null,null,null,null,null,null,null,null,null,null,"2016-05-23","2016-06-10",{"$f":"EDATE(AA30,48)","v":"2020-05-23"},"2021-05-23",null,{"$f":"IF(AD30>0,DATEDIF(AA30,AD30,\"m\")&\" мес., \"&DATEDIF(AA30,AD30,\"md\")&\" дн.\",\" \")","v":"60 мес., 0 дн."}]